{"text_format":"3","workbook":"xlsx","n_sheets":7,"sheets":["경험치 계산","상재템","상재템 리스트","사냥터 목록","아이템 제작","경험치 구간","다음레벨"],"not_rendered":{"macros":1,"defined_names":18,"comments":2},"read":"whole","date_system":"1900"}

{"sheet":"경험치 계산","index":0,"n_rows":15,"n_cols":10,"rows_kept":15,"merged":[[0,0,0,8],[1,6,1,7],[13,0,13,8],[14,0,14,8]]}
["사냥"]
["시작 시간",43445.48112175926,"종료 시간",{"$f":"NOW()","v":43445.55191539352},"사냥 시간",{"$f":"D2-B2","v":"01:41:56.570"},"오늘의 날짜",null,{"$f":"TODAY()","v":"2018-12-11"}]
["구분","시작경험치","시작레벨","최종경험치","최종레벨","경험치총합","레벨업총합","다음레벨","필요 경험치","세로 막대형2"]
["1 클라"]
["본캐",null,{"$f":"INDEX('경험치 구간'!$B$1:$B$251,MATCH(LARGE(IF('경험치 구간'!$A$1:$A$251<=B5,'경험치 구간'!$A$1:$A$251),1),'경험치 구간'!$A$1:$A$251,0))","v":1},null,{"$f":"INDEX('경험치 구간'!$B$1:$B$251,MATCH(LARGE(IF('경험치 구간'!$A$1:$A$251<=D5,'경험치 구간'!$A$1:$A$251),1),'경험치 구간'!$A$1:$A$251,0))","v":1},{"$f":"D5-B5","v":0},0,{"$f":"E5+1","v":2},{"$f":"J5-D5","v":20},{"$f":"VLOOKUP(H5,다음레벨!$A$2:$D$251,2,0)","v":20}]
["격수",null,{"$f":"INDEX('경험치 구간'!$B$1:$B$251,MATCH(LARGE(IF('경험치 구간'!$A$1:$A$251<=B6,'경험치 구간'!$A$1:$A$251),1),'경험치 구간'!$A$1:$A$251,0))","v":1},null,{"$f":"INDEX('경험치 구간'!$B$1:$B$251,MATCH(LARGE(IF('경험치 구간'!$A$1:$A$251<=D6,'경험치 구간'!$A$1:$A$251),1),'경험치 구간'!$A$1:$A$251,0))","v":1},{"$f":"D6-B6","v":0},{"$f":"E6-C6","v":0},{"$f":"E6+1","v":2},{"$f":"J6-D6","v":20},{"$f":"VLOOKUP(H6,다음레벨!$A$2:$D$251,2,0)","v":20}]
["쩔캐",null,{"$f":"INDEX('경험치 구간'!$B$1:$B$251,MATCH(LARGE(IF('경험치 구간'!$A$1:$A$251<=B7,'경험치 구간'!$A$1:$A$251),1),'경험치 구간'!$A$1:$A$251,0))","v":1},null,{"$f":"INDEX('경험치 구간'!$B$1:$B$251,MATCH(LARGE(IF('경험치 구간'!$A$1:$A$251<=D7,'경험치 구간'!$A$1:$A$251),1),'경험치 구간'!$A$1:$A$251,0))","v":1},{"$f":"D7-B7","v":0},{"$f":"E7-C7","v":0},2,{"$f":"J7-D7","v":20},{"$f":"VLOOKUP(H7,다음레벨!$A$2:$D$251,2,0)","v":20}]
["2 클라",{"$nulls":8},{"$f":"VLOOKUP(H8,다음레벨!$A$2:$D$251,2,0)","v":{"$error":"#N/A"}}]
["본캐",null,{"$f":"INDEX('경험치 구간'!$B$1:$B$251,MATCH(LARGE(IF('경험치 구간'!$A$1:$A$251<=B9,'경험치 구간'!$A$1:$A$251),1),'경험치 구간'!$A$1:$A$251,0))","v":1},null,{"$f":"INDEX('경험치 구간'!$B$1:$B$251,MATCH(LARGE(IF('경험치 구간'!$A$1:$A$251<=D9,'경험치 구간'!$A$1:$A$251),1),'경험치 구간'!$A$1:$A$251,0))","v":1},{"$f":"D9-B9","v":0},{"$f":"E9-C9","v":0},2,{"$f":"J9-D9","v":20},{"$f":"VLOOKUP(H9,다음레벨!$A$2:$D$251,2,0)","v":20}]
["쩔캐",null,{"$f":"INDEX('경험치 구간'!$B$1:$B$251,MATCH(LARGE(IF('경험치 구간'!$A$1:$A$251<=B10,'경험치 구간'!$A$1:$A$251),1),'경험치 구간'!$A$1:$A$251,0))","v":1},null,{"$f":"INDEX('경험치 구간'!$B$1:$B$251,MATCH(LARGE(IF('경험치 구간'!$A$1:$A$251<=D10,'경험치 구간'!$A$1:$A$251),1),'경험치 구간'!$A$1:$A$251,0))","v":1},{"$f":"D10-B10","v":0},{"$f":"E10-C10","v":0},2,{"$f":"J10-D10","v":20},{"$f":"VLOOKUP(H10,다음레벨!$A$2:$D$251,2,0)","v":20}]
["3 클라",{"$nulls":8},{"$f":"VLOOKUP(H11,다음레벨!$A$2:$D$251,2,0)","v":{"$error":"#N/A"}}]
["본캐",null,{"$f":"INDEX('경험치 구간'!$B$1:$B$251,MATCH(LARGE(IF('경험치 구간'!$A$1:$A$251<=B12,'경험치 구간'!$A$1:$A$251),1),'경험치 구간'!$A$1:$A$251,0))","v":1},null,{"$f":"INDEX('경험치 구간'!$B$1:$B$251,MATCH(LARGE(IF('경험치 구간'!$A$1:$A$251<=D12,'경험치 구간'!$A$1:$A$251),1),'경험치 구간'!$A$1:$A$251,0))","v":1},{"$f":"D12-B12","v":0},{"$f":"E12-C12","v":0},2,{"$f":"J12-D12","v":20},{"$f":"VLOOKUP(H12,다음레벨!$A$2:$D$251,2,0)","v":20}]
["쩔캐",null,{"$f":"INDEX('경험치 구간'!$B$1:$B$251,MATCH(LARGE(IF('경험치 구간'!$A$1:$A$251<=B13,'경험치 구간'!$A$1:$A$251),1),'경험치 구간'!$A$1:$A$251,0))","v":1},null,{"$f":"INDEX('경험치 구간'!$B$1:$B$251,MATCH(LARGE(IF('경험치 구간'!$A$1:$A$251<=D13,'경험치 구간'!$A$1:$A$251),1),'경험치 구간'!$A$1:$A$251,0))","v":1},0,0,2,{"$f":"J13-D13","v":20},{"$f":"VLOOKUP(H13,다음레벨!$A$2:$D$251,2,0)","v":20}]
[]
["제작 : 단군서버 마일스톤즈"]

{"sheet":"상재템","index":1,"n_rows":25,"n_cols":7,"rows_kept":25,"merged":[[0,0,0,6],[17,0,17,4],[19,0,19,6]]}
["상재"]
["시작 시간",{"$f":"'경험치 계산'!B2","v":43445.48112175926},"종료 시간",{"$f":"'경험치 계산'!D2","v":43445.55191539352},"사냥 시간",{"$f":"D2-B2","v":"01:41:56.570"},{"$f":"'경험치 계산'!I2","v":"2018-12-11"}]
["순번","아이템명","중요도","상재액","수량","총액","비고"]
[1," ",{"$f":"VLOOKUP(B4,'상재템 리스트'!$A$1:$D$670,3,0)","v":"X"},{"$f":"VLOOKUP(B4,'상재템 리스트'!$A$1:$D$670,2,0)","v":0},null,{"$f":"D4*E4","v":0},{"$f":"VLOOKUP(B4,'상재템 리스트'!$A$1:$D$670,4,0)","v":0}]
[2," ",{"$f":"VLOOKUP(B5,'상재템 리스트'!$A$1:$D$670,3,0)","v":"X"},{"$f":"VLOOKUP(B5,'상재템 리스트'!$A$1:$D$670,2,0)","v":0},null,{"$f":"D5*E5","v":0},{"$f":"VLOOKUP(B5,'상재템 리스트'!$A$1:$D$670,4,0)","v":0}]
[3," ",{"$f":"VLOOKUP(B6,'상재템 리스트'!$A$1:$D$670,3,0)","v":"X"},{"$f":"VLOOKUP(B6,'상재템 리스트'!$A$1:$D$670,2,0)","v":0},null,0,{"$f":"VLOOKUP(B6,'상재템 리스트'!$A$1:$D$670,4,0)","v":0}]
[4," ",{"$f":"VLOOKUP(B7,'상재템 리스트'!$A$1:$D$670,3,0)","v":"X"},{"$f":"VLOOKUP(B7,'상재템 리스트'!$A$1:$D$670,2,0)","v":0},null,0,{"$f":"VLOOKUP(B7,'상재템 리스트'!$A$1:$D$670,4,0)","v":0}]
[5," ",{"$f":"VLOOKUP(B8,'상재템 리스트'!$A$1:$D$670,3,0)","v":"X"},{"$f":"VLOOKUP(B8,'상재템 리스트'!$A$1:$D$670,2,0)","v":0},null,0,{"$f":"VLOOKUP(B8,'상재템 리스트'!$A$1:$D$670,4,0)","v":0}]
[6," ",{"$f":"VLOOKUP(B9,'상재템 리스트'!$A$1:$D$670,3,0)","v":"X"},{"$f":"VLOOKUP(B9,'상재템 리스트'!$A$1:$D$670,2,0)","v":0},null,0,{"$f":"VLOOKUP(B9,'상재템 리스트'!$A$1:$D$670,4,0)","v":0}]
[7," ",{"$f":"VLOOKUP(B10,'상재템 리스트'!$A$1:$D$670,3,0)","v":"X"},{"$f":"VLOOKUP(B10,'상재템 리스트'!$A$1:$D$670,2,0)","v":0},null,0,{"$f":"VLOOKUP(B10,'상재템 리스트'!$A$1:$D$670,4,0)","v":0}]
[8," ",{"$f":"VLOOKUP(B11,'상재템 리스트'!$A$1:$D$670,3,0)","v":"X"},{"$f":"VLOOKUP(B11,'상재템 리스트'!$A$1:$D$670,2,0)","v":0},null,0,{"$f":"VLOOKUP(B11,'상재템 리스트'!$A$1:$D$670,4,0)","v":0}]
[9," ",{"$f":"VLOOKUP(B12,'상재템 리스트'!$A$1:$D$670,3,0)","v":"X"},{"$f":"VLOOKUP(B12,'상재템 리스트'!$A$1:$D$670,2,0)","v":0},null,{"$f":"D12*E12","v":0},{"$f":"VLOOKUP(B12,'상재템 리스트'!$A$1:$D$670,4,0)","v":0}]
[10," ",{"$f":"VLOOKUP(B13,'상재템 리스트'!$A$1:$D$670,3,0)","v":"X"},{"$f":"VLOOKUP(B13,'상재템 리스트'!$A$1:$D$670,2,0)","v":0},null,0,{"$f":"VLOOKUP(B13,'상재템 리스트'!$A$1:$D$670,4,0)","v":0}]
[11," ",{"$f":"VLOOKUP(B14,'상재템 리스트'!$A$1:$D$670,3,0)","v":"X"},{"$f":"VLOOKUP(B14,'상재템 리스트'!$A$1:$D$670,2,0)","v":0},null,0,{"$f":"VLOOKUP(B14,'상재템 리스트'!$A$1:$D$670,4,0)","v":0}]
[12," ",{"$f":"VLOOKUP(B15,'상재템 리스트'!$A$1:$D$670,3,0)","v":"X"},{"$f":"VLOOKUP(B15,'상재템 리스트'!$A$1:$D$670,2,0)","v":0},null,0,{"$f":"VLOOKUP(B15,'상재템 리스트'!$A$1:$D$670,4,0)","v":0}]
[13," ",{"$f":"VLOOKUP(B16,'상재템 리스트'!$A$1:$D$670,3,0)","v":"X"},{"$f":"VLOOKUP(B16,'상재템 리스트'!$A$1:$D$670,2,0)","v":0},null,0,{"$f":"VLOOKUP(B16,'상재템 리스트'!$A$1:$D$670,4,0)","v":0}]
[14," ",{"$f":"VLOOKUP(B17,'상재템 리스트'!$A$1:$D$670,3,0)","v":"X"},{"$f":"VLOOKUP(B17,'상재템 리스트'!$A$1:$D$670,2,0)","v":0},null,0,{"$f":"VLOOKUP(B17,'상재템 리스트'!$A$1:$D$670,4,0)","v":0}]
["총액",{"$nulls":4},{"$f":"SUM(F4:F17)","v":0}]
[]
["제작 : 단군서버 마일스톤즈"]
["상재 계산기 사용방법"]
["1. 상재템 리스트(시트참조)에 아이템명, 금액, 중요도를 업데이트"]
["2. 상재템 시트로 다시 넘어와 아이템명에 기록한 아이템명 입력"]
["3. 아이템창에 아이템이 없을 시 스페이스바로 공란 지정"]
["4. 중요도 구분은 '상재, 퀘스트, 재료, 아이템, 육의전' 으로 구분 부탁 드립니다"]

{"sheet":"상재템 리스트","index":2,"n_rows":45,"n_cols":6,"rows_kept":45}
["아이템명","상재액","귀중도","비고","국적","위치"]
[" ",0,"X"]
["거대집게발",{"v":390000,"d":"390,000"},"상재",null,"몽골","몽골필드"]
["검편1",{"v":520000,"d":"520,000"},"상재",null,"조선","검은상단주둔지"]
["관찰자의 뿔",{"v":520000,"d":"520,000"},"상재",null,"중국","수상한동굴"]
["광호갈기",{"v":520000,"d":"520,000"},"상재"]
["광호의발톱",{"v":520000,"d":"520,000"},"상재"]
["구구도",{"v":152152,"d":"152,152"},"상재",null,"공통","수미산"]
["기창",{"v":445645,"d":"445,645"},"상재",null,"공통","수미산"]
["낡은귀면도",{"v":947648,"d":"947,648"},"상재",null,"조선","검은상단주둔지"]
["낡은대장궁",{"v":1042412,"d":"1,042,412"},"상재"]
["낡은양귀비인형",{"v":947596,"d":"947,596"},"상재",null,"중국","수상한동굴"]
["낡은태형부",{"v":803678,"d":"803,678"},"상재"]
["뇌전의 기운이 서린뿔",{"v":390000,"d":"390,000"},"상재",null,"공통","수미산"]
["뇌정석",{"v":260000,"d":"260,000"},"상재",null,"조선","대관령계곡"]
["뇌정석",{"v":260000,"d":"260,000"},"상재",null,"공통","수미산"]
["담덕주술비법",{"v":390000,"d":"390,000"},"상재"]
["딱딱한다리껍질",{"v":520000,"d":"520,000"},"상재",null,"중국","북해빙굴"]
["몽골각궁의조각",{"v":390000,"d":"390,000"},"상재",null,"몽골","몽골필드"]
["미륵의염주",3,"아이템",null,"중국","북해빙굴"]
["백귀의등껍질",{"v":520000,"d":"520,000"},"상재",null,"중국","북해빙굴"]
["백호의단지",{"v":1040000,"d":"1,040,000"},"퀘스트"]
["불꽃의 정수",{"v":216665,"d":"216,665"},"상재",null,"중국","수상한동굴"]
["붉은고독층",{"v":216665,"d":"216,665"},"퀘스트",null,"조선","검은상단주둔지"]
["삼첨검의 조각",{"v":260000,"d":"260,000"},"상재",null,"공통","수미산"]
["상급영혼석(怒)",{"v":216665,"d":"216,665"},"상재"]
["상급영혼석(喜)",{"v":216665,"d":"216,665"},"상재"]
["수상한고기",{"v":216665,"d":"216,665"},"상재",null,"조선","검은상단주둔지"]
["신수의근원(백호)",{"v":3900000,"d":"3,900,000"},"재료"]
["신수의근원(현무)",{"v":3900000,"d":"3,900,000"},"재료","힘의근원 재료","중국","북해빙굴"]
["영혼석",{"v":390000,"d":"390,000"},"상재",null,"조선","검은상단주둔지"]
["원주민술사의 실험일지",{"v":216665,"d":"216,665"},"퀘스트",null,"중국","중국필드"]
["작은뇌의속성석",null,"육의전",null,"몽골","몽골필드"]
["적궁의조각",{"v":520000,"d":"520,000"},"상재"]
["제석천범종",{"v":467089,"d":"467,089"},"상재",null,"공통","수미산"]
["조각난 언월도",{"v":260000,"d":"260,000"},"상재",null,"공통","수미산"]
["조련용채찍",{"v":520000,"d":"520,000"},"상재",null,"조선","검은상단주둔지"]
["질긴머리카락",{"v":520000,"d":"520,000"},"상재"]
["찢어진서신",{"v":216665,"d":"216,665"},"상재"]
["청랑어금니",{"v":520000,"d":"520,000"},"상재"]
["투척병의유언장",{"v":216665,"d":"216,665"},"상재","백상회 퀘스트","중국","북해빙굴"]
["해골목걸이",{"v":520000,"d":"520,000"},"상재"]
["현무의 단지",{"v":1040000,"d":"1,040,000"},"퀘스트","백상회 퀘스트","중국","북해빙굴"]
["현무의단지",{"v":1040000,"d":"1,040,000"},"퀘스트"]
["흉수의혼",{"v":1600000,"d":"1,600,000"},"육의전",null,"공통","수미산"]

{"sheet":"사냥터 목록","index":3,"n_rows":20,"n_cols":8,"rows_kept":20,"hidden":true,"merged":[[1,0,17,0]]}
["국적","조선","중국","일본","대만","인도","몽골","공통"]
["사냥터","조선필드","중국필드","일본필드","대만필드","네팔필드","몽골필드","유명계"]
[null,"대관령","만리장성","일본해저동굴","해적동굴","석굴던전","왕의무덤","륭산"]
[null,"대관령계곡","진시황릉(흉)","하치만타이온천","대만해저동굴","북인도필드",null,"수미산"]
[null,"대관령-화전민촌","원공의대나무숲","대설산(얼음성)","대둔산(흉)","타지마할묘",null,"거대보스"]
[null,"고수동굴","소림사","이시즈치산","백호림","동인도필드",null,"국가토벌전"]
[null,"거제해저동굴","샤오링의후원","귀곡성(흉)","야수림","태양사원"]
[null,"한라산","챠우신전","청룡담",null,"무투장"]
[null,"무령왕릉(흉)","북해빙굴","오로치의둥지",null,"서인도필드"]
[null,"월기봉","수상한동굴",null,null,"데바의사원(지하)"]
[null,"천년호","늪지대",null,null,"남인도필드"]
[null,"검은상단야영지","파오의탑",null,null,"버려진해안사원"]
[null,"계림","빙궁"]
[null,"무도장","신선곡"]
[null,"개마장원"]
[null,"화구산"]
[null,"검은상단주둔지"]
[null,"검은상단병영"]
[null,"비밀의장소"]
[null,"비밀의제단"]

{"sheet":"아이템 제작","index":4,"n_rows":7,"n_cols":7,"rows_kept":7,"hidden":true}
["필요 아이템","필요 수량","현황",null,"필요 아이템","필요 수량","현황"]
["주작부",1,1,null,"신수의근원(백호)",10,10]
["붉은색알",1,0,null,"신수의근원(청룡)",10,10]
["불의속성석",5,0,null,"신수의근원(주작)",10,10]
["정기의구슬(火)",3,0,null,"신수의근원(현무)",10,10]
["1억지전",3,0,null,"신수의근원(기린)",10,10]
["힘의근원",2,0,null,"심연의정수",10,0]

{"sheet":"경험치 구간","index":5,"n_rows":251,"n_cols":4,"rows_kept":251,"hidden":true}
["누적 총 경험치","레벨","다음 렙업에 필요한 경험치","보너스스텟"]
[{"v":30000000000,"d":"30,000,000,000"},250,"-",20]
[{"v":28686973590,"d":"28,686,973,590"},249,{"v":1313026410,"d":"1,313,026,410"},20]
[{"v":27460317460,"d":"27,460,317,460"},248,{"v":1226656130,"d":"1,226,656,130"},20]
[{"v":26303661330,"d":"26,303,661,330"},247,{"v":1156656130,"d":"1,156,656,130"},20]
[{"v":25217005200,"d":"25,217,005,200"},246,{"v":1086656130,"d":"1,086,656,130"},20]
[{"v":24190349070,"d":"24,190,349,070"},245,{"v":1026656130,"d":"1,026,656,130"},20]
[{"v":23213692940,"d":"23,213,692,940"},244,{"v":976656130,"d":"976,656,130"},20]
[{"v":22277036810,"d":"22,277,036,810"},243,{"v":936656130,"d":"936,656,130"},20]
[{"v":21380380680,"d":"21,380,380,680"},242,{"v":896656130,"d":"896,656,130"},20]
[{"v":20523724550,"d":"20,523,724,550"},241,{"v":856656130,"d":"856,656,130"},20]
[{"v":19697068420,"d":"19,697,068,420"},240,{"v":826656130,"d":"826,656,130"},20]
[{"v":18900411290,"d":"18,900,411,290"},239,{"v":796656130,"d":"796,656,130"},20]
[{"v":18133756160,"d":"18,133,756,160"},238,{"v":766656130,"d":"766,656,130"},20]
[{"v":17397100030,"d":"17,397,100,030"},237,{"v":736656130,"d":"736,656,130"},20]
[{"v":16690443900,"d":"16,690,443,900"},236,{"v":706656130,"d":"706,656,130"},20]
[{"v":16006787770,"d":"16,006,787,770"},235,{"v":683656130,"d":"683,656,130"},20]
[{"v":15346131640,"d":"15,346,131,640"},234,{"v":660656130,"d":"660,656,130"},20]
[{"v":14708475510,"d":"14,708,475,510"},233,{"v":637656130,"d":"637,656,130"},20]
[{"v":14093819380,"d":"14,093,819,380"},232,{"v":614656130,"d":"614,656,130"},20]
[{"v":13502163250,"d":"13,502,163,250"},231,{"v":591656130,"d":"591,656,130"},20]
[{"v":12928507120,"d":"12,928,507,120"},230,{"v":573656130,"d":"573,656,130"},20]
[{"v":12372850990,"d":"12,372,850,990"},229,{"v":555656130,"d":"555,656,130"},20]
[{"v":11835194860,"d":"11,835,194,860"},228,{"v":537656130,"d":"537,656,130"},20]
[{"v":11315538730,"d":"11,315,538,730"},227,{"v":519656130,"d":"519,656,130"},20]
[{"v":10813882600,"d":"10,813,882,600"},226,{"v":501656130,"d":"501,656,130"},20]
[{"v":10327226470,"d":"10,327,226,470"},225,{"v":486656130,"d":"486,656,130"},20]
[{"v":9855570340,"d":"9,855,570,340"},224,{"v":471656130,"d":"471,656,130"},20]
[{"v":9398914210,"d":"9,398,914,210"},223,{"v":456656130,"d":"456,656,130"},20]
[{"v":8957258080,"d":"8,957,258,080"},222,{"v":441656130,"d":"441,656,130"},20]
[{"v":8530601950,"d":"8,530,601,950"},221,{"v":426656130,"d":"426,656,130"},20]
[{"v":8115945820,"d":"8,115,945,820"},220,{"v":414656130,"d":"414,656,130"},19]
[{"v":7713289690,"d":"7,713,289,690"},219,{"v":402656130,"d":"402,656,130"},19]
[{"v":7322633560,"d":"7,322,633,560"},218,{"v":390656130,"d":"390,656,130"},19]
[{"v":6943977430,"d":"6,943,977,430"},217,{"v":378656130,"d":"378,656,130"},19]
[{"v":6577321300,"d":"6,577,321,300"},216,{"v":366656130,"d":"366,656,130"},19]
[{"v":6220665170,"d":"6,220,665,170"},215,{"v":356656130,"d":"356,656,130"},18]
[{"v":5874009040,"d":"5,874,009,040"},214,{"v":346656130,"d":"346,656,130"},18]
[{"v":5537352910,"d":"5,537,352,910"},213,{"v":336656130,"d":"336,656,130"},18]
[{"v":5210696780,"d":"5,210,696,780"},212,{"v":326656130,"d":"326,656,130"},18]
[{"v":4894040650,"d":"4,894,040,650"},211,{"v":316656130,"d":"316,656,130"},18]
[{"v":4586384520,"d":"4,586,384,520"},210,{"v":307656130,"d":"307,656,130"},17]
[{"v":4287728390,"d":"4,287,728,390"},209,{"v":298656130,"d":"298,656,130"},17]
[{"v":3998072260,"d":"3,998,072,260"},208,{"v":289656130,"d":"289,656,130"},17]
[{"v":3717416130,"d":"3,717,416,130"},207,{"v":280656130,"d":"280,656,130"},17]
[{"v":3445760000,"d":"3,445,760,000"},206,{"v":271656130,"d":"271,656,130"},17]
[{"v":3183103870,"d":"3,183,103,870"},205,{"v":262656130,"d":"262,656,130"},16]
[{"v":2928447740,"d":"2,928,447,740"},204,{"v":254656130,"d":"254,656,130"},16]
[{"v":2681791610,"d":"2,681,791,610"},203,{"v":246656130,"d":"246,656,130"},16]
[{"v":2443135480,"d":"2,443,135,480"},202,{"v":238656130,"d":"238,656,130"},16]
[{"v":2212479350,"d":"2,212,479,350"},201,{"v":230656130,"d":"230,656,130"},16]
[{"v":1989823220,"d":"1,989,823,220"},200,{"v":222656130,"d":"222,656,130"},15]
[{"v":1775167090,"d":"1,775,167,090"},199,{"v":214656130,"d":"214,656,130"},15]
[{"v":1580510960,"d":"1,580,510,960"},198,{"v":194656130,"d":"194,656,130"},15]
[{"v":1405854830,"d":"1,405,854,830"},197,{"v":174656130,"d":"174,656,130"},15]
[{"v":1251198700,"d":"1,251,198,700"},196,{"v":154656130,"d":"154,656,130"},15]
[{"v":1116542570,"d":"1,116,542,570"},195,{"v":134656130,"d":"134,656,130"},14]
[{"v":1000886440,"d":"1,000,886,440"},194,{"v":115656130,"d":"115,656,130"},14]
[{"v":902230310,"d":"902,230,310"},193,{"v":98656130,"d":"98,656,130"},14]
[{"v":818574180,"d":"818,574,180"},192,{"v":83656130,"d":"83,656,130"},14]
[{"v":747918050,"d":"747,918,050"},191,{"v":70656130,"d":"70,656,130"},14]
[{"v":688261920,"d":"688,261,920"},190,{"v":59656130,"d":"59,656,130"},14]
[{"v":637605790,"d":"637,605,790"},189,{"v":50656130,"d":"50,656,130"},14]
[{"v":593949660,"d":"593,949,660"},188,{"v":43656130,"d":"43,656,130"},14]
[{"v":555693530,"d":"555,693,530"},187,{"v":38256130,"d":"38,256,130"},14]
[{"v":522237400,"d":"522,237,400"},186,{"v":33456130,"d":"33,456,130"},14]
[{"v":492981270,"d":"492,981,270"},185,{"v":29256130,"d":"29,256,130"},14]
[{"v":467325140,"d":"467,325,140"},184,{"v":25656130,"d":"25,656,130"},14]
[{"v":443359010,"d":"443,359,010"},183,{"v":23966130,"d":"23,966,130"},14]
[{"v":422552880,"d":"422,552,880"},182,{"v":20806130,"d":"20,806,130"},14]
[{"v":402856750,"d":"402,856,750"},181,{"v":19696130,"d":"19,696,130"},14]
[{"v":384200620,"d":"384,200,620"},180,{"v":18656130,"d":"18,656,130"},14]
[{"v":366534490,"d":"366,534,490"},179,{"v":17666130,"d":"17,666,130"},13]
[{"v":349818360,"d":"349,818,360"},178,{"v":16716130,"d":"16,716,130"},13]
[{"v":334012230,"d":"334,012,230"},177,{"v":15806130,"d":"15,806,130"},13]
[{"v":319076100,"d":"319,076,100"},176,{"v":14936130,"d":"14,936,130"},13]
[{"v":304969970,"d":"304,969,970"},175,{"v":14106130,"d":"14,106,130"},13]
[{"v":291653840,"d":"291,653,840"},174,{"v":13316130,"d":"13,316,130"},12]
[{"v":279087710,"d":"279,087,710"},173,{"v":12566130,"d":"12,566,130"},12]
[{"v":267231580,"d":"267,231,580"},172,{"v":11856130,"d":"11,856,130"},12]
{"$rows_left_out":172}
{"sheet":"다음레벨","index":6,"n_rows":251,"n_cols":4,"rows_kept":251,"hidden":true}
["레벨","누적 총 경험치","다음 렙업에 필요한 경험치","보너스스텟"]
[250,{"v":30000000000,"d":"30,000,000,000"},"-",20]
[249,{"v":28686973590,"d":"28,686,973,590"},{"v":1313026410,"d":"1,313,026,410"},20]
[248,{"v":27460317460,"d":"27,460,317,460"},{"v":1226656130,"d":"1,226,656,130"},20]
[247,{"v":26303661330,"d":"26,303,661,330"},{"v":1156656130,"d":"1,156,656,130"},20]
[246,{"v":25217005200,"d":"25,217,005,200"},{"v":1086656130,"d":"1,086,656,130"},20]
[245,{"v":24190349070,"d":"24,190,349,070"},{"v":1026656130,"d":"1,026,656,130"},20]
[244,{"v":23213692940,"d":"23,213,692,940"},{"v":976656130,"d":"976,656,130"},20]
[243,{"v":22277036810,"d":"22,277,036,810"},{"v":936656130,"d":"936,656,130"},20]
[242,{"v":21380380680,"d":"21,380,380,680"},{"v":896656130,"d":"896,656,130"},20]
[241,{"v":20523724550,"d":"20,523,724,550"},{"v":856656130,"d":"856,656,130"},20]
[240,{"v":19697068420,"d":"19,697,068,420"},{"v":826656130,"d":"826,656,130"},20]
[239,{"v":18900411290,"d":"18,900,411,290"},{"v":796656130,"d":"796,656,130"},20]
[238,{"v":18133756160,"d":"18,133,756,160"},{"v":766656130,"d":"766,656,130"},20]
[237,{"v":17397100030,"d":"17,397,100,030"},{"v":736656130,"d":"736,656,130"},20]
[236,{"v":16690443900,"d":"16,690,443,900"},{"v":706656130,"d":"706,656,130"},20]
[235,{"v":16006787770,"d":"16,006,787,770"},{"v":683656130,"d":"683,656,130"},20]
[234,{"v":15346131640,"d":"15,346,131,640"},{"v":660656130,"d":"660,656,130"},20]
[233,{"v":14708475510,"d":"14,708,475,510"},{"v":637656130,"d":"637,656,130"},20]
[232,{"v":14093819380,"d":"14,093,819,380"},{"v":614656130,"d":"614,656,130"},20]
[231,{"v":13502163250,"d":"13,502,163,250"},{"v":591656130,"d":"591,656,130"},20]
[230,{"v":12928507120,"d":"12,928,507,120"},{"v":573656130,"d":"573,656,130"},20]
[229,{"v":12372850990,"d":"12,372,850,990"},{"v":555656130,"d":"555,656,130"},20]
[228,{"v":11835194860,"d":"11,835,194,860"},{"v":537656130,"d":"537,656,130"},20]
[227,{"v":11315538730,"d":"11,315,538,730"},{"v":519656130,"d":"519,656,130"},20]
[226,{"v":10813882600,"d":"10,813,882,600"},{"v":501656130,"d":"501,656,130"},20]
[225,{"v":10327226470,"d":"10,327,226,470"},{"v":486656130,"d":"486,656,130"},20]
[224,{"v":9855570340,"d":"9,855,570,340"},{"v":471656130,"d":"471,656,130"},20]
[223,{"v":9398914210,"d":"9,398,914,210"},{"v":456656130,"d":"456,656,130"},20]
[222,{"v":8957258080,"d":"8,957,258,080"},{"v":441656130,"d":"441,656,130"},20]
[221,{"v":8530601950,"d":"8,530,601,950"},{"v":426656130,"d":"426,656,130"},20]
[220,{"v":8115945820,"d":"8,115,945,820"},{"v":414656130,"d":"414,656,130"},19]
[219,{"v":7713289690,"d":"7,713,289,690"},{"v":402656130,"d":"402,656,130"},19]
[218,{"v":7322633560,"d":"7,322,633,560"},{"v":390656130,"d":"390,656,130"},19]
[217,{"v":6943977430,"d":"6,943,977,430"},{"v":378656130,"d":"378,656,130"},19]
[216,{"v":6577321300,"d":"6,577,321,300"},{"v":366656130,"d":"366,656,130"},19]
[215,{"v":6220665170,"d":"6,220,665,170"},{"v":356656130,"d":"356,656,130"},18]
[214,{"v":5874009040,"d":"5,874,009,040"},{"v":346656130,"d":"346,656,130"},18]
[213,{"v":5537352910,"d":"5,537,352,910"},{"v":336656130,"d":"336,656,130"},18]
[212,{"v":5210696780,"d":"5,210,696,780"},{"v":326656130,"d":"326,656,130"},18]
[211,{"v":4894040650,"d":"4,894,040,650"},{"v":316656130,"d":"316,656,130"},18]
[210,{"v":4586384520,"d":"4,586,384,520"},{"v":307656130,"d":"307,656,130"},17]
[209,{"v":4287728390,"d":"4,287,728,390"},{"v":298656130,"d":"298,656,130"},17]
[208,{"v":3998072260,"d":"3,998,072,260"},{"v":289656130,"d":"289,656,130"},17]
[207,{"v":3717416130,"d":"3,717,416,130"},{"v":280656130,"d":"280,656,130"},17]
[206,{"v":3445760000,"d":"3,445,760,000"},{"v":271656130,"d":"271,656,130"},17]
[205,{"v":3183103870,"d":"3,183,103,870"},{"v":262656130,"d":"262,656,130"},16]
[204,{"v":2928447740,"d":"2,928,447,740"},{"v":254656130,"d":"254,656,130"},16]
[203,{"v":2681791610,"d":"2,681,791,610"},{"v":246656130,"d":"246,656,130"},16]
[202,{"v":2443135480,"d":"2,443,135,480"},{"v":238656130,"d":"238,656,130"},16]
[201,{"v":2212479350,"d":"2,212,479,350"},{"v":230656130,"d":"230,656,130"},16]
[200,{"v":1989823220,"d":"1,989,823,220"},{"v":222656130,"d":"222,656,130"},15]
[199,{"v":1775167090,"d":"1,775,167,090"},{"v":214656130,"d":"214,656,130"},15]
[198,{"v":1580510960,"d":"1,580,510,960"},{"v":194656130,"d":"194,656,130"},15]
[197,{"v":1405854830,"d":"1,405,854,830"},{"v":174656130,"d":"174,656,130"},15]
[196,{"v":1251198700,"d":"1,251,198,700"},{"v":154656130,"d":"154,656,130"},15]
[195,{"v":1116542570,"d":"1,116,542,570"},{"v":134656130,"d":"134,656,130"},14]
[194,{"v":1000886440,"d":"1,000,886,440"},{"v":115656130,"d":"115,656,130"},14]
[193,{"v":902230310,"d":"902,230,310"},{"v":98656130,"d":"98,656,130"},14]
[192,{"v":818574180,"d":"818,574,180"},{"v":83656130,"d":"83,656,130"},14]
[191,{"v":747918050,"d":"747,918,050"},{"v":70656130,"d":"70,656,130"},14]
[190,{"v":688261920,"d":"688,261,920"},{"v":59656130,"d":"59,656,130"},14]
[189,{"v":637605790,"d":"637,605,790"},{"v":50656130,"d":"50,656,130"},14]
[188,{"v":593949660,"d":"593,949,660"},{"v":43656130,"d":"43,656,130"},14]
[187,{"v":555693530,"d":"555,693,530"},{"v":38256130,"d":"38,256,130"},14]
[186,{"v":522237400,"d":"522,237,400"},{"v":33456130,"d":"33,456,130"},14]
[185,{"v":492981270,"d":"492,981,270"},{"v":29256130,"d":"29,256,130"},14]
[184,{"v":467325140,"d":"467,325,140"},{"v":25656130,"d":"25,656,130"},14]
[183,{"v":443359010,"d":"443,359,010"},{"v":23966130,"d":"23,966,130"},14]
[182,{"v":422552880,"d":"422,552,880"},{"v":20806130,"d":"20,806,130"},14]
[181,{"v":402856750,"d":"402,856,750"},{"v":19696130,"d":"19,696,130"},14]
[180,{"v":384200620,"d":"384,200,620"},{"v":18656130,"d":"18,656,130"},14]
[179,{"v":366534490,"d":"366,534,490"},{"v":17666130,"d":"17,666,130"},13]
[178,{"v":349818360,"d":"349,818,360"},{"v":16716130,"d":"16,716,130"},13]
[177,{"v":334012230,"d":"334,012,230"},{"v":15806130,"d":"15,806,130"},13]
[176,{"v":319076100,"d":"319,076,100"},{"v":14936130,"d":"14,936,130"},13]
[175,{"v":304969970,"d":"304,969,970"},{"v":14106130,"d":"14,106,130"},13]
[174,{"v":291653840,"d":"291,653,840"},{"v":13316130,"d":"13,316,130"},12]
[173,{"v":279087710,"d":"279,087,710"},{"v":12566130,"d":"12,566,130"},12]
[172,{"v":267231580,"d":"267,231,580"},{"v":11856130,"d":"11,856,130"},12]
{"$rows_left_out":171}