{"text_format":"3","workbook":"xlsx","n_sheets":7,"sheets":["경험치 계산","상재템","상재템 리스트","사냥터 목록","아이템 제작","경험치 구간","다음레벨"],"not_rendered":{"macros":1,"defined_names":18,"comments":2},"read":"whole","date_system":"1900"}

{"sheet":"경험치 계산","index":0,"n_rows":15,"n_cols":10,"rows_kept":15,"merged":[[0,0,0,8],[1,6,1,7],[13,0,13,8],[14,0,14,8]]}
["사냥"]
["시작 시간",43445.48112175926,"종료 시간",{"$f":"NOW()","v":43445.55191539352},"사냥 시간",{"$f":"D2-B2","v":"01:41:56.570"},"오늘의 날짜",null,{"$f":"TODAY()","v":"2018-12-11"}]
["구분","시작경험치","시작레벨","최종경험치","최종레벨","경험치총합","레벨업총합","다음레벨","필요 경험치","세로 막대형2"]
["1 클라"]
["본캐",null,{"$f":"INDEX('경험치 구간'!$B$1:$B$251,MATCH(LARGE(IF('경험치 구간'!$A$1:$A$251<=B5,'경험치 구간'!$A$1:$A$251),1),'경험치 구간'!$A$1:$A$251,0))","v":1},null,{"$f":"INDEX('경험치 구간'!$B$1:$B$251,MATCH(LARGE(IF('경험치 구간'!$A$1:$A$251<=D5,'경험치 구간'!$A$1:$A$251),1),'경험치 구간'!$A$1:$A$251,0))","v":1},{"$f":"D5-B5","v":0},0,{"$f":"E5+1","v":2},{"$f":"J5-D5","v":20},{"$f":"VLOOKUP(H5,다음레벨!$A$2:$D$251,2,0)","v":20}]
["격수",null,{"$f":"INDEX('경험치 구간'!$B$1:$B$251,MATCH(LARGE(IF('경험치 구간'!$A$1:$A$251<=B6,'경험치 구간'!$A$1:$A$251),1),'경험치 구간'!$A$1:$A$251,0))","v":1},null,{"$f":"INDEX('경험치 구간'!$B$1:$B$251,MATCH(LARGE(IF('경험치 구간'!$A$1:$A$251<=D6,'경험치 구간'!$A$1:$A$251),1),'경험치 구간'!$A$1:$A$251,0))","v":1},{"$f":"D6-B6","v":0},{"$f":"E6-C6","v":0},{"$f":"E6+1","v":2},{"$f":"J6-D6","v":20},{"$f":"VLOOKUP(H6,다음레벨!$A$2:$D$251,2,0)","v":20}]
["쩔캐",null,{"$f":"INDEX('경험치 구간'!$B$1:$B$251,MATCH(LARGE(IF('경험치 구간'!$A$1:$A$251<=B7,'경험치 구간'!$A$1:$A$251),1),'경험치 구간'!$A$1:$A$251,0))","v":1},null,{"$f":"INDEX('경험치 구간'!$B$1:$B$251,MATCH(LARGE(IF('경험치 구간'!$A$1:$A$251<=D7,'경험치 구간'!$A$1:$A$251),1),'경험치 구간'!$A$1:$A$251,0))","v":1},{"$f":"D7-B7","v":0},{"$f":"E7-C7","v":0},2,{"$f":"J7-D7","v":20},{"$f":"VLOOKUP(H7,다음레벨!$A$2:$D$251,2,0)","v":20}]
["2 클라",{"$nulls":8},{"$f":"VLOOKUP(H8,다음레벨!$A$2:$D$251,2,0)","v":{"$error":"#N/A"}}]
["본캐",null,{"$f":"INDEX('경험치 구간'!$B$1:$B$251,MATCH(LARGE(IF('경험치 구간'!$A$1:$A$251<=B9,'경험치 구간'!$A$1:$A$251),1),'경험치 구간'!$A$1:$A$251,0))","v":1},null,{"$f":"INDEX('경험치 구간'!$B$1:$B$251,MATCH(LARGE(IF('경험치 구간'!$A$1:$A$251<=D9,'경험치 구간'!$A$1:$A$251),1),'경험치 구간'!$A$1:$A$251,0))","v":1},{"$f":"D9-B9","v":0},{"$f":"E9-C9","v":0},2,{"$f":"J9-D9","v":20},{"$f":"VLOOKUP(H9,다음레벨!$A$2:$D$251,2,0)","v":20}]
["쩔캐",null,{"$f":"INDEX('경험치 구간'!$B$1:$B$251,MATCH(LARGE(IF('경험치 구간'!$A$1:$A$251<=B10,'경험치 구간'!$A$1:$A$251),1),'경험치 구간'!$A$1:$A$251,0))","v":1},null,{"$f":"INDEX('경험치 구간'!$B$1:$B$251,MATCH(LARGE(IF('경험치 구간'!$A$1:$A$251<=D10,'경험치 구간'!$A$1:$A$251),1),'경험치 구간'!$A$1:$A$251,0))","v":1},{"$f":"D10-B10","v":0},{"$f":"E10-C10","v":0},2,{"$f":"J10-D10","v":20},{"$f":"VLOOKUP(H10,다음레벨!$A$2:$D$251,2,0)","v":20}]
["3 클라",{"$nulls":8},{"$f":"VLOOKUP(H11,다음레벨!$A$2:$D$251,2,0)","v":{"$error":"#N/A"}}]
["본캐",null,{"$f":"INDEX('경험치 구간'!$B$1:$B$251,MATCH(LARGE(IF('경험치 구간'!$A$1:$A$251<=B12,'경험치 구간'!$A$1:$A$251),1),'경험치 구간'!$A$1:$A$251,0))","v":1},null,{"$f":"INDEX('경험치 구간'!$B$1:$B$251,MATCH(LARGE(IF('경험치 구간'!$A$1:$A$251<=D12,'경험치 구간'!$A$1:$A$251),1),'경험치 구간'!$A$1:$A$251,0))","v":1},{"$f":"D12-B12","v":0},{"$f":"E12-C12","v":0},2,{"$f":"J12-D12","v":20},{"$f":"VLOOKUP(H12,다음레벨!$A$2:$D$251,2,0)","v":20}]
["쩔캐",null,{"$f":"INDEX('경험치 구간'!$B$1:$B$251,MATCH(LARGE(IF('경험치 구간'!$A$1:$A$251<=B13,'경험치 구간'!$A$1:$A$251),1),'경험치 구간'!$A$1:$A$251,0))","v":1},null,{"$f":"INDEX('경험치 구간'!$B$1:$B$251,MATCH(LARGE(IF('경험치 구간'!$A$1:$A$251<=D13,'경험치 구간'!$A$1:$A$251),1),'경험치 구간'!$A$1:$A$251,0))","v":1},0,0,2,{"$f":"J13-D13","v":20},{"$f":"VLOOKUP(H13,다음레벨!$A$2:$D$251,2,0)","v":20}]
[]
["제작 : 단군서버 마일스톤즈"]

{"sheet":"상재템","index":1,"n_rows":25,"n_cols":7,"rows_kept":25,"merged":[[0,0,0,6],[17,0,17,4],[19,0,19,6]]}
["상재"]
["시작 시간",{"$f":"'경험치 계산'!B2","v":43445.48112175926},"종료 시간",{"$f":"'경험치 계산'!D2","v":43445.55191539352},"사냥 시간",{"$f":"D2-B2","v":"01:41:56.570"},{"$f":"'경험치 계산'!I2","v":"2018-12-11"}]
["순번","아이템명","중요도","상재액","수량","총액","비고"]
[1," ",{"$f":"VLOOKUP(B4,'상재템 리스트'!$A$1:$D$670,3,0)","v":"X"},{"$f":"VLOOKUP(B4,'상재템 리스트'!$A$1:$D$670,2,0)","v":0},null,{"$f":"D4*E4","v":0},{"$f":"VLOOKUP(B4,'상재템 리스트'!$A$1:$D$670,4,0)","v":0}]
[2," ",{"$f":"VLOOKUP(B5,'상재템 리스트'!$A$1:$D$670,3,0)","v":"X"},{"$f":"VLOOKUP(B5,'상재템 리스트'!$A$1:$D$670,2,0)","v":0},null,{"$f":"D5*E5","v":0},{"$f":"VLOOKUP(B5,'상재템 리스트'!$A$1:$D$670,4,0)","v":0}]
[3," ",{"$f":"VLOOKUP(B6,'상재템 리스트'!$A$1:$D$670,3,0)","v":"X"},{"$f":"VLOOKUP(B6,'상재템 리스트'!$A$1:$D$670,2,0)","v":0},null,0,{"$f":"VLOOKUP(B6,'상재템 리스트'!$A$1:$D$670,4,0)","v":0}]
[4," ",{"$f":"VLOOKUP(B7,'상재템 리스트'!$A$1:$D$670,3,0)","v":"X"},{"$f":"VLOOKUP(B7,'상재템 리스트'!$A$1:$D$670,2,0)","v":0},null,0,{"$f":"VLOOKUP(B7,'상재템 리스트'!$A$1:$D$670,4,0)","v":0}]
[5," ",{"$f":"VLOOKUP(B8,'상재템 리스트'!$A$1:$D$670,3,0)","v":"X"},{"$f":"VLOOKUP(B8,'상재템 리스트'!$A$1:$D$670,2,0)","v":0},null,0,{"$f":"VLOOKUP(B8,'상재템 리스트'!$A$1:$D$670,4,0)","v":0}]
[6," ",{"$f":"VLOOKUP(B9,'상재템 리스트'!$A$1:$D$670,3,0)","v":"X"},{"$f":"VLOOKUP(B9,'상재템 리스트'!$A$1:$D$670,2,0)","v":0},null,0,{"$f":"VLOOKUP(B9,'상재템 리스트'!$A$1:$D$670,4,0)","v":0}]
[7," ",{"$f":"VLOOKUP(B10,'상재템 리스트'!$A$1:$D$670,3,0)","v":"X"},{"$f":"VLOOKUP(B10,'상재템 리스트'!$A$1:$D$670,2,0)","v":0},null,0,{"$f":"VLOOKUP(B10,'상재템 리스트'!$A$1:$D$670,4,0)","v":0}]
[8," ",{"$f":"VLOOKUP(B11,'상재템 리스트'!$A$1:$D$670,3,0)","v":"X"},{"$f":"VLOOKUP(B11,'상재템 리스트'!$A$1:$D$670,2,0)","v":0},null,0,{"$f":"VLOOKUP(B11,'상재템 리스트'!$A$1:$D$670,4,0)","v":0}]
[9," ",{"$f":"VLOOKUP(B12,'상재템 리스트'!$A$1:$D$670,3,0)","v":"X"},{"$f":"VLOOKUP(B12,'상재템 리스트'!$A$1:$D$670,2,0)","v":0},null,{"$f":"D12*E12","v":0},{"$f":"VLOOKUP(B12,'상재템 리스트'!$A$1:$D$670,4,0)","v":0}]
[10," ",{"$f":"VLOOKUP(B13,'상재템 리스트'!$A$1:$D$670,3,0)","v":"X"},{"$f":"VLOOKUP(B13,'상재템 리스트'!$A$1:$D$670,2,0)","v":0},null,0,{"$f":"VLOOKUP(B13,'상재템 리스트'!$A$1:$D$670,4,0)","v":0}]
[11," ",{"$f":"VLOOKUP(B14,'상재템 리스트'!$A$1:$D$670,3,0)","v":"X"},{"$f":"VLOOKUP(B14,'상재템 리스트'!$A$1:$D$670,2,0)","v":0},null,0,{"$f":"VLOOKUP(B14,'상재템 리스트'!$A$1:$D$670,4,0)","v":0}]
[12," ",{"$f":"VLOOKUP(B15,'상재템 리스트'!$A$1:$D$670,3,0)","v":"X"},{"$f":"VLOOKUP(B15,'상재템 리스트'!$A$1:$D$670,2,0)","v":0},null,0,{"$f":"VLOOKUP(B15,'상재템 리스트'!$A$1:$D$670,4,0)","v":0}]
[13," ",{"$f":"VLOOKUP(B16,'상재템 리스트'!$A$1:$D$670,3,0)","v":"X"},{"$f":"VLOOKUP(B16,'상재템 리스트'!$A$1:$D$670,2,0)","v":0},null,0,{"$f":"VLOOKUP(B16,'상재템 리스트'!$A$1:$D$670,4,0)","v":0}]
[14," ",{"$f":"VLOOKUP(B17,'상재템 리스트'!$A$1:$D$670,3,0)","v":"X"},{"$f":"VLOOKUP(B17,'상재템 리스트'!$A$1:$D$670,2,0)","v":0},null,0,{"$f":"VLOOKUP(B17,'상재템 리스트'!$A$1:$D$670,4,0)","v":0}]
["총액",{"$nulls":4},{"$f":"SUM(F4:F17)","v":0}]
[]
["제작 : 단군서버 마일스톤즈"]
["상재 계산기 사용방법"]
["1. 상재템 리스트(시트참조)에 아이템명, 금액, 중요도를 업데이트"]
["2. 상재템 시트로 다시 넘어와 아이템명에 기록한 아이템명 입력"]
["3. 아이템창에 아이템이 없을 시 스페이스바로 공란 지정"]
["4. 중요도 구분은 '상재, 퀘스트, 재료, 아이템, 육의전' 으로 구분 부탁 드립니다"]

{"sheet":"상재템 리스트","index":2,"n_rows":45,"n_cols":6,"rows_kept":45}
["아이템명","상재액","귀중도","비고","국적","위치"]
[" ",0,"X"]
["거대집게발",{"v":390000,"d":"390,000"},"상재",null,"몽골","몽골필드"]
["검편1",{"v":520000,"d":"520,000"},"상재",null,"조선","검은상단주둔지"]
["관찰자의 뿔",{"v":520000,"d":"520,000"},"상재",null,"중국","수상한동굴"]
["광호갈기",{"v":520000,"d":"520,000"},"상재"]
["광호의발톱",{"v":520000,"d":"520,000"},"상재"]
["구구도",{"v":152152,"d":"152,152"},"상재",null,"공통","수미산"]
["기창",{"v":445645,"d":"445,645"},"상재",null,"공통","수미산"]
["낡은귀면도",{"v":947648,"d":"947,648"},"상재",null,"조선","검은상단주둔지"]
["낡은대장궁",{"v":1042412,"d":"1,042,412"},"상재"]
["낡은양귀비인형",{"v":947596,"d":"947,596"},"상재",null,"중국","수상한동굴"]
["낡은태형부",{"v":803678,"d":"803,678"},"상재"]
["뇌전의 기운이 서린뿔",{"v":390000,"d":"390,000"},"상재",null,"공통","수미산"]
["뇌정석",{"v":260000,"d":"260,000"},"상재",null,"조선","대관령계곡"]
["뇌정석",{"v":260000,"d":"260,000"},"상재",null,"공통","수미산"]
["담덕주술비법",{"v":390000,"d":"390,000"},"상재"]
["딱딱한다리껍질",{"v":520000,"d":"520,000"},"상재",null,"중국","북해빙굴"]
["몽골각궁의조각",{"v":390000,"d":"390,000"},"상재",null,"몽골","몽골필드"]
["미륵의염주",3,"아이템",null,"중국","북해빙굴"]
["백귀의등껍질",{"v":520000,"d":"520,000"},"상재",null,"중국","북해빙굴"]
["백호의단지",{"v":1040000,"d":"1,040,000"},"퀘스트"]
["불꽃의 정수",{"v":216665,"d":"216,665"},"상재",null,"중국","수상한동굴"]
["붉은고독층",{"v":216665,"d":"216,665"},"퀘스트",null,"조선","검은상단주둔지"]
["삼첨검의 조각",{"v":260000,"d":"260,000"},"상재",null,"공통","수미산"]
["상급영혼석(怒)",{"v":216665,"d":"216,665"},"상재"]
["상급영혼석(喜)",{"v":216665,"d":"216,665"},"상재"]
["수상한고기",{"v":216665,"d":"216,665"},"상재",null,"조선","검은상단주둔지"]
["신수의근원(백호)",{"v":3900000,"d":"3,900,000"},"재료"]
["신수의근원(현무)",{"v":3900000,"d":"3,900,000"},"재료","힘의근원 재료","중국","북해빙굴"]
["영혼석",{"v":390000,"d":"390,000"},"상재",null,"조선","검은상단주둔지"]
["원주민술사의 실험일지",{"v":216665,"d":"216,665"},"퀘스트",null,"중국","중국필드"]
["작은뇌의속성석",null,"육의전",null,"몽골","몽골필드"]
["적궁의조각",{"v":520000,"d":"520,000"},"상재"]
["제석천범종",{"v":467089,"d":"467,089"},"상재",null,"공통","수미산"]
["조각난 언월도",{"v":260000,"d":"260,000"},"상재",null,"공통","수미산"]
["조련용채찍",{"v":520000,"d":"520,000"},"상재",null,"조선","검은상단주둔지"]
["질긴머리카락",{"v":520000,"d":"520,000"},"상재"]
["찢어진서신",{"v":216665,"d":"216,665"},"상재"]
["청랑어금니",{"v":520000,"d":"520,000"},"상재"]
["투척병의유언장",{"v":216665,"d":"216,665"},"상재","백상회 퀘스트","중국","북해빙굴"]
["해골목걸이",{"v":520000,"d":"520,000"},"상재"]
["현무의 단지",{"v":1040000,"d":"1,040,000"},"퀘스트","백상회 퀘스트","중국","북해빙굴"]
["현무의단지",{"v":1040000,"d":"1,040,000"},"퀘스트"]
["흉수의혼",{"v":1600000,"d":"1,600,000"},"육의전",null,"공통","수미산"]

{"sheet":"사냥터 목록","index":3,"n_rows":20,"n_cols":8,"rows_kept":20,"hidden":true,"merged":[[1,0,17,0]]}
["국적","조선","중국","일본","대만","인도","몽골","공통"]
["사냥터","조선필드","중국필드","일본필드","대만필드","네팔필드","몽골필드","유명계"]
[null,"대관령","만리장성","일본해저동굴","해적동굴","석굴던전","왕의무덤","륭산"]
[null,"대관령계곡","진시황릉(흉)","하치만타이온천","대만해저동굴","북인도필드",null,"수미산"]
[null,"대관령-화전민촌","원공의대나무숲","대설산(얼음성)","대둔산(흉)","타지마할묘",null,"거대보스"]
[null,"고수동굴","소림사","이시즈치산","백호림","동인도필드",null,"국가토벌전"]
[null,"거제해저동굴","샤오링의후원","귀곡성(흉)","야수림","태양사원"]
[null,"한라산","챠우신전","청룡담",null,"무투장"]
[null,"무령왕릉(흉)","북해빙굴","오로치의둥지",null,"서인도필드"]
[null,"월기봉","수상한동굴",null,null,"데바의사원(지하)"]
[null,"천년호","늪지대",null,null,"남인도필드"]
[null,"검은상단야영지","파오의탑",null,null,"버려진해안사원"]
[null,"계림","빙궁"]
[null,"무도장","신선곡"]
[null,"개마장원"]
[null,"화구산"]
[null,"검은상단주둔지"]
[null,"검은상단병영"]
[null,"비밀의장소"]
[null,"비밀의제단"]

{"sheet":"아이템 제작","index":4,"n_rows":7,"n_cols":7,"rows_kept":7,"hidden":true}
["필요 아이템","필요 수량","현황",null,"필요 아이템","필요 수량","현황"]
["주작부",1,1,null,"신수의근원(백호)",10,10]
["붉은색알",1,0,null,"신수의근원(청룡)",10,10]
["불의속성석",5,0,null,"신수의근원(주작)",10,10]
["정기의구슬(火)",3,0,null,"신수의근원(현무)",10,10]
["1억지전",3,0,null,"신수의근원(기린)",10,10]
["힘의근원",2,0,null,"심연의정수",10,0]

{"sheet":"경험치 구간","index":5,"n_rows":251,"n_cols":4,"rows_kept":251,"hidden":true}
["누적 총 경험치","레벨","다음 렙업에 필요한 경험치","보너스스텟"]
[{"v":30000000000,"d":"30,000,000,000"},250,"-",20]
[{"v":28686973590,"d":"28,686,973,590"},249,{"v":1313026410,"d":"1,313,026,410"},20]
[{"v":27460317460,"d":"27,460,317,460"},248,{"v":1226656130,"d":"1,226,656,130"},20]
[{"v":26303661330,"d":"26,303,661,330"},247,{"v":1156656130,"d":"1,156,656,130"},20]
[{"v":25217005200,"d":"25,217,005,200"},246,{"v":1086656130,"d":"1,086,656,130"},20]
[{"v":24190349070,"d":"24,190,349,070"},245,{"v":1026656130,"d":"1,026,656,130"},20]
[{"v":23213692940,"d":"23,213,692,940"},244,{"v":976656130,"d":"976,656,130"},20]
[{"v":22277036810,"d":"22,277,036,810"},243,{"v":936656130,"d":"936,656,130"},20]
[{"v":21380380680,"d":"21,380,380,680"},242,{"v":896656130,"d":"896,656,130"},20]
[{"v":20523724550,"d":"20,523,724,550"},241,{"v":856656130,"d":"856,656,130"},20]
[{"v":19697068420,"d":"19,697,068,420"},240,{"v":826656130,"d":"826,656,130"},20]
[{"v":18900411290,"d":"18,900,411,290"},239,{"v":796656130,"d":"796,656,130"},20]
[{"v":18133756160,"d":"18,133,756,160"},238,{"v":766656130,"d":"766,656,130"},20]
[{"v":17397100030,"d":"17,397,100,030"},237,{"v":736656130,"d":"736,656,130"},20]
[{"v":16690443900,"d":"16,690,443,900"},236,{"v":706656130,"d":"706,656,130"},20]
[{"v":16006787770,"d":"16,006,787,770"},235,{"v":683656130,"d":"683,656,130"},20]
[{"v":15346131640,"d":"15,346,131,640"},234,{"v":660656130,"d":"660,656,130"},20]
[{"v":14708475510,"d":"14,708,475,510"},233,{"v":637656130,"d":"637,656,130"},20]
[{"v":14093819380,"d":"14,093,819,380"},232,{"v":614656130,"d":"614,656,130"},20]
[{"v":13502163250,"d":"13,502,163,250"},231,{"v":591656130,"d":"591,656,130"},20]
[{"v":12928507120,"d":"12,928,507,120"},230,{"v":573656130,"d":"573,656,130"},20]
[{"v":12372850990,"d":"12,372,850,990"},229,{"v":555656130,"d":"555,656,130"},20]
[{"v":11835194860,"d":"11,835,194,860"},228,{"v":537656130,"d":"537,656,130"},20]
[{"v":11315538730,"d":"11,315,538,730"},227,{"v":519656130,"d":"519,656,130"},20]
[{"v":10813882600,"d":"10,813,882,600"},226,{"v":501656130,"d":"501,656,130"},20]
[{"v":10327226470,"d":"10,327,226,470"},225,{"v":486656130,"d":"486,656,130"},20]
[{"v":9855570340,"d":"9,855,570,340"},224,{"v":471656130,"d":"471,656,130"},20]
[{"v":9398914210,"d":"9,398,914,210"},223,{"v":456656130,"d":"456,656,130"},20]
[{"v":8957258080,"d":"8,957,258,080"},222,{"v":441656130,"d":"441,656,130"},20]
[{"v":8530601950,"d":"8,530,601,950"},221,{"v":426656130,"d":"426,656,130"},20]
[{"v":8115945820,"d":"8,115,945,820"},220,{"v":414656130,"d":"414,656,130"},19]
[{"v":7713289690,"d":"7,713,289,690"},219,{"v":402656130,"d":"402,656,130"},19]
[{"v":7322633560,"d":"7,322,633,560"},218,{"v":390656130,"d":"390,656,130"},19]
[{"v":6943977430,"d":"6,943,977,430"},217,{"v":378656130,"d":"378,656,130"},19]
[{"v":6577321300,"d":"6,577,321,300"},216,{"v":366656130,"d":"366,656,130"},19]
[{"v":6220665170,"d":"6,220,665,170"},215,{"v":356656130,"d":"356,656,130"},18]
[{"v":5874009040,"d":"5,874,009,040"},214,{"v":346656130,"d":"346,656,130"},18]
[{"v":5537352910,"d":"5,537,352,910"},213,{"v":336656130,"d":"336,656,130"},18]
[{"v":5210696780,"d":"5,210,696,780"},212,{"v":326656130,"d":"326,656,130"},18]
[{"v":4894040650,"d":"4,894,040,650"},211,{"v":316656130,"d":"316,656,130"},18]
[{"v":4586384520,"d":"4,586,384,520"},210,{"v":307656130,"d":"307,656,130"},17]
[{"v":4287728390,"d":"4,287,728,390"},209,{"v":298656130,"d":"298,656,130"},17]
[{"v":3998072260,"d":"3,998,072,260"},208,{"v":289656130,"d":"289,656,130"},17]
[{"v":3717416130,"d":"3,717,416,130"},207,{"v":280656130,"d":"280,656,130"},17]
[{"v":3445760000,"d":"3,445,760,000"},206,{"v":271656130,"d":"271,656,130"},17]
[{"v":3183103870,"d":"3,183,103,870"},205,{"v":262656130,"d":"262,656,130"},16]
[{"v":2928447740,"d":"2,928,447,740"},204,{"v":254656130,"d":"254,656,130"},16]
[{"v":2681791610,"d":"2,681,791,610"},203,{"v":246656130,"d":"246,656,130"},16]
[{"v":2443135480,"d":"2,443,135,480"},202,{"v":238656130,"d":"238,656,130"},16]
[{"v":2212479350,"d":"2,212,479,350"},201,{"v":230656130,"d":"230,656,130"},16]
[{"v":1989823220,"d":"1,989,823,220"},200,{"v":222656130,"d":"222,656,130"},15]
[{"v":1775167090,"d":"1,775,167,090"},199,{"v":214656130,"d":"214,656,130"},15]
[{"v":1580510960,"d":"1,580,510,960"},198,{"v":194656130,"d":"194,656,130"},15]
[{"v":1405854830,"d":"1,405,854,830"},197,{"v":174656130,"d":"174,656,130"},15]
[{"v":1251198700,"d":"1,251,198,700"},196,{"v":154656130,"d":"154,656,130"},15]
[{"v":1116542570,"d":"1,116,542,570"},195,{"v":134656130,"d":"134,656,130"},14]
[{"v":1000886440,"d":"1,000,886,440"},194,{"v":115656130,"d":"115,656,130"},14]
[{"v":902230310,"d":"902,230,310"},193,{"v":98656130,"d":"98,656,130"},14]
[{"v":818574180,"d":"818,574,180"},192,{"v":83656130,"d":"83,656,130"},14]
[{"v":747918050,"d":"747,918,050"},191,{"v":70656130,"d":"70,656,130"},14]
[{"v":688261920,"d":"688,261,920"},190,{"v":59656130,"d":"59,656,130"},14]
[{"v":637605790,"d":"637,605,790"},189,{"v":50656130,"d":"50,656,130"},14]
[{"v":593949660,"d":"593,949,660"},188,{"v":43656130,"d":"43,656,130"},14]
[{"v":555693530,"d":"555,693,530"},187,{"v":38256130,"d":"38,256,130"},14]
[{"v":522237400,"d":"522,237,400"},186,{"v":33456130,"d":"33,456,130"},14]
[{"v":492981270,"d":"492,981,270"},185,{"v":29256130,"d":"29,256,130"},14]
[{"v":467325140,"d":"467,325,140"},184,{"v":25656130,"d":"25,656,130"},14]
[{"v":443359010,"d":"443,359,010"},183,{"v":23966130,"d":"23,966,130"},14]
[{"v":422552880,"d":"422,552,880"},182,{"v":20806130,"d":"20,806,130"},14]
[{"v":402856750,"d":"402,856,750"},181,{"v":19696130,"d":"19,696,130"},14]
[{"v":384200620,"d":"384,200,620"},180,{"v":18656130,"d":"18,656,130"},14]
[{"v":366534490,"d":"366,534,490"},179,{"v":17666130,"d":"17,666,130"},13]
[{"v":349818360,"d":"349,818,360"},178,{"v":16716130,"d":"16,716,130"},13]
[{"v":334012230,"d":"334,012,230"},177,{"v":15806130,"d":"15,806,130"},13]
[{"v":319076100,"d":"319,076,100"},176,{"v":14936130,"d":"14,936,130"},13]
[{"v":304969970,"d":"304,969,970"},175,{"v":14106130,"d":"14,106,130"},13]
[{"v":291653840,"d":"291,653,840"},174,{"v":13316130,"d":"13,316,130"},12]
[{"v":279087710,"d":"279,087,710"},173,{"v":12566130,"d":"12,566,130"},12]
[{"v":267231580,"d":"267,231,580"},172,{"v":11856130,"d":"11,856,130"},12]
[{"v":256045450,"d":"256,045,450"},171,{"v":11186130,"d":"11,186,130"},12]
[{"v":245489320,"d":"245,489,320"},170,{"v":10556130,"d":"10,556,130"},12]
[{"v":235523190,"d":"235,523,190"},169,{"v":9966130,"d":"9,966,130"},11]
[{"v":226117060,"d":"226,117,060"},168,{"v":9406130,"d":"9,406,130"},11]
[{"v":217240930,"d":"217,240,930"},167,{"v":8876130,"d":"8,876,130"},11]
[{"v":208864800,"d":"208,864,800"},166,{"v":8376130,"d":"8,376,130"},11]
[{"v":200958670,"d":"200,958,670"},165,{"v":7906130,"d":"7,906,130"},11]
[{"v":193492540,"d":"193,492,540"},164,{"v":7466130,"d":"7,466,130"},11]
[{"v":186436410,"d":"186,436,410"},163,{"v":7056130,"d":"7,056,130"},11]
[{"v":179640280,"d":"179,640,280"},162,{"v":6676130,"d":"6,676,130"},11]
[{"v":173434150,"d":"173,434,150"},161,{"v":6326130,"d":"6,326,130"},11]
[{"v":167428020,"d":"167,428,020"},160,{"v":6006130,"d":"6,006,130"},11]
[{"v":161711890,"d":"161,711,890"},159,{"v":5716130,"d":"5,716,130"},10]
[{"v":156265760,"d":"156,265,760"},158,{"v":5446190,"d":"5,446,190"},10]
[{"v":151069630,"d":"151,069,630"},157,{"v":5196130,"d":"5,196,130"},10]
[{"v":146103500,"d":"146,103,500"},156,{"v":4966130,"d":"4,966,130"},10]
[{"v":141347370,"d":"141,347,370"},155,{"v":4756130,"d":"4,756,130"},10]
[{"v":136781240,"d":"136,781,240"},154,{"v":4566130,"d":"4,566,130"},10]
[{"v":132385110,"d":"132,385,110"},153,{"v":4396130,"d":"4,396,130"},10]
[{"v":128138980,"d":"128,138,980"},152,{"v":4246130,"d":"4,246,130"},10]
[{"v":124022850,"d":"124,022,850"},151,{"v":4116130,"d":"4,116,130"},10]
[{"v":120016720,"d":"120,016,720"},150,{"v":4006130,"d":"4,006,130"},10]
[{"v":116118590,"d":"116,118,590"},149,{"v":3898130,"d":"3,898,130"},9]
[{"v":112326460,"d":"112,326,460"},148,{"v":3792130,"d":"3,792,130"},9]
[{"v":108638330,"d":"108,638,330"},147,{"v":3688130,"d":"3,688,130"},9]
[{"v":105052200,"d":"105,052,200"},146,{"v":3586130,"d":"3,586,130"},9]
[{"v":101566070,"d":"101,566,070"},145,{"v":3486130,"d":"3,486,130"},9]
[{"v":98117940,"d":"98,117,940"},144,{"v":3388130,"d":"3,388,130"},8]
[{"v":94885810,"d":"94,885,810"},143,{"v":3292130,"d":"3,292,130"},8]
[{"v":91687680,"d":"91,687,680"},142,{"v":3198130,"d":"3,198,130"},8]
[{"v":88581550,"d":"88,581,550"},141,{"v":3106130,"d":"3,106,130"},8]
[{"v":85565420,"d":"85,565,420"},140,{"v":3016130,"d":"3,016,130"},8]
[{"v":82637290,"d":"82,637,290"},139,{"v":2928130,"d":"2,928,130"},7]
[{"v":79795160,"d":"79,795,160"},138,{"v":2842130,"d":"2,842,130"},7]
[{"v":77037030,"d":"77,037,030"},137,{"v":2758130,"d":"2,758,130"},7]
[{"v":74360900,"d":"74,360,900"},136,{"v":2676130,"d":"2,676,130"},7]
[{"v":71764770,"d":"71,764,770"},135,{"v":2596130,"d":"2,596,130"},7]
[{"v":69246640,"d":"69,246,640"},134,{"v":2518130,"d":"2,518,130"},6]
[{"v":66804510,"d":"66,804,510"},133,{"v":2442130,"d":"2,442,130"},6]
[{"v":64436380,"d":"64,436,380"},132,{"v":2368130,"d":"2,368,130"},6]
[{"v":62140250,"d":"62,140,250"},131,{"v":2296130,"d":"2,296,130"},6]
[{"v":59914120,"d":"59,914,120"},130,{"v":2226130,"d":"2,226,130"},6]
[{"v":57756490,"d":"57,756,490"},129,{"v":2157630,"d":"2,157,630"},5]
[{"v":55665860,"d":"55,665,860"},128,{"v":2090630,"d":"2,090,630"},5]
[{"v":53640730,"d":"53,640,730"},127,{"v":2025130,"d":"2,025,130"},5]
[{"v":51679600,"d":"51,679,600"},126,{"v":1961130,"d":"1,961,130"},5]
[{"v":49780970,"d":"49,780,970"},125,{"v":1898630,"d":"1,898,630"},5]
[{"v":47943340,"d":"47,943,340"},124,{"v":1837630,"d":"1,837,630"},5]
[{"v":46165210,"d":"46,165,210"},123,{"v":1778130,"d":"1,778,130"},5]
[{"v":44445080,"d":"44,445,080"},122,{"v":1720130,"d":"1,720,130"},5]
[{"v":42781450,"d":"42,781,450"},121,{"v":1663630,"d":"1,663,630"},5]
[{"v":41172820,"d":"41,172,820"},120,{"v":1608630,"d":"1,608,630"},5]
[{"v":39617690,"d":"39,617,690"},119,{"v":1555130,"d":"1,555,130"},4]
[{"v":38114560,"d":"38,114,560"},118,{"v":1503130,"d":"1,503,130"},4]
[{"v":36661930,"d":"36,661,930"},117,{"v":1452630,"d":"1,452,630"},4]
[{"v":35258300,"d":"35,258,300"},116,{"v":1403630,"d":"1,403,630"},4]
[{"v":33902170,"d":"33,902,170"},115,{"v":1356130,"d":"1,356,130"},4]
[{"v":32592040,"d":"32,592,040"},114,{"v":1310130,"d":"1,310,130"},4]
[{"v":31326410,"d":"31,326,410"},113,{"v":1265630,"d":"1,265,630"},4]
[{"v":30103780,"d":"30,103,780"},112,{"v":1222630,"d":"1,222,630"},4]
[{"v":28922650,"d":"28,922,650"},111,{"v":1181130,"d":"1,181,130"},4]
[{"v":27781520,"d":"27,781,520"},110,{"v":1141130,"d":"1,141,130"},4]
[{"v":26679390,"d":"26,679,390"},109,{"v":1102130,"d":"1,102,130"},4]
[{"v":25615260,"d":"25,615,260"},108,{"v":1064130,"d":"1,064,130"},4]
[{"v":24588130,"d":"24,588,130"},107,{"v":1027130,"d":"1,027,130"},4]
[{"v":23597000,"d":"23,597,000"},106,{"v":991130,"d":"991,130"},4]
[{"v":22640870,"d":"22,640,870"},105,{"v":956130,"d":"956,130"},4]
[{"v":21718740,"d":"21,718,740"},104,{"v":922130,"d":"922,130"},4]
[{"v":20829610,"d":"20,829,610"},103,{"v":889130,"d":"889,130"},4]
[{"v":19972480,"d":"19,972,480"},102,{"v":857130,"d":"857,130"},4]
[{"v":19146350,"d":"19,146,350"},101,{"v":826130,"d":"826,130"},4]
[{"v":18350220,"d":"18,350,220"},100,{"v":796130,"d":"796,130"},4]
[{"v":17583090,"d":"17,583,090"},99,{"v":767130,"d":"767,130"},4]
[{"v":16843960,"d":"16,843,960"},98,{"v":739130,"d":"739,130"},4]
[{"v":16131830,"d":"16,131,830"},97,{"v":712130,"d":"712,130"},4]
[{"v":15445700,"d":"15,445,700"},96,{"v":686130,"d":"686,130"},4]
[{"v":14784570,"d":"14,784,570"},95,{"v":661130,"d":"661,130"},4]
[{"v":14147440,"d":"14,147,440"},94,{"v":637130,"d":"637,130"},4]
[{"v":13533310,"d":"13,533,310"},93,{"v":614130,"d":"614,130"},4]
[{"v":12941180,"d":"12,941,180"},92,{"v":592130,"d":"592,130"},4]
[{"v":12370050,"d":"12,370,050"},91,{"v":571130,"d":"571,130"},4]
[{"v":11818920,"d":"11,818,920"},90,{"v":551130,"d":"551,130"},4]
[{"v":11287290,"d":"11,287,290"},89,{"v":531630,"d":"531,630"},4]
[{"v":10774660,"d":"10,774,660"},88,{"v":512630,"d":"512,630"},4]
[{"v":10280530,"d":"10,280,530"},87,{"v":494130,"d":"494,130"},4]
[{"v":9804400,"d":"9,804,400"},86,{"v":476130,"d":"476,130"},4]
[{"v":9345770,"d":"9,345,770"},85,{"v":458630,"d":"458,630"},4]
[{"v":8904140,"d":"8,904,140"},84,{"v":441630,"d":"441,630"},4]
[{"v":8479010,"d":"8,479,010"},83,{"v":425130,"d":"425,130"},4]
[{"v":8069880,"d":"8,069,880"},82,{"v":409130,"d":"409,130"},4]
[{"v":7676250,"d":"7,676,250"},81,{"v":393630,"d":"393,630"},4]
[{"v":7297620,"d":"7,297,620"},80,{"v":378630,"d":"378,630"},4]
[{"v":6933590,"d":"6,933,590"},79,{"v":364030,"d":"364,030"},4]
[{"v":6583760,"d":"6,583,760"},78,{"v":349830,"d":"349,830"},4]
[{"v":6247730,"d":"6,247,730"},77,{"v":336030,"d":"336,030"},4]
[{"v":5925100,"d":"5,925,100"},76,{"v":322630,"d":"322,630"},4]
[{"v":5615470,"d":"5,615,470"},75,{"v":309630,"d":"309,630"},4]
[{"v":5318440,"d":"5,318,440"},74,{"v":297030,"d":"297,030"},4]
[{"v":5033610,"d":"5,033,610"},73,{"v":284830,"d":"284,830"},4]
[{"v":4760580,"d":"4,760,580"},72,{"v":273030,"d":"273,030"},4]
[{"v":4498950,"d":"4,498,950"},71,{"v":261630,"d":"261,630"},4]
[{"v":4248320,"d":"4,248,320"},70,{"v":250630,"d":"250,630"},4]
[{"v":4008390,"d":"4,008,390"},69,{"v":239930,"d":"239,930"},4]
[{"v":3778860,"d":"3,778,860"},68,{"v":229530,"d":"229,530"},4]
[{"v":3559430,"d":"3,559,430"},67,{"v":219430,"d":"219,430"},4]
[{"v":3349800,"d":"3,349,800"},66,{"v":209630,"d":"209,630"},4]
[{"v":3169670,"d":"3,169,670"},65,{"v":200130,"d":"200,130"},4]
[{"v":2958740,"d":"2,958,740"},64,{"v":190930,"d":"190,930"},4]
[{"v":2776710,"d":"2,776,710"},63,{"v":182030,"d":"182,030"},4]
[{"v":2603280,"d":"2,603,280"},62,{"v":173430,"d":"173,430"},4]
[{"v":2438150,"d":"2,438,150"},61,{"v":165130,"d":"165,130"},4]
[{"v":2281020,"d":"2,281,020"},60,{"v":157130,"d":"157,130"},4]
[{"v":2131640,"d":"2,131,640"},59,{"v":149380,"d":"149,380"},4]
[{"v":1989760,"d":"1,989,760"},58,{"v":141880,"d":"141,880"},4]
[{"v":1855130,"d":"1,855,130"},57,{"v":134630,"d":"134,630"},4]
[{"v":1727500,"d":"1,727,500"},56,{"v":127630,"d":"127,630"},4]
[{"v":1606620,"d":"1,606,620"},55,{"v":120880,"d":"120,880"},4]
[{"v":1492240,"d":"1,492,240"},54,{"v":114380,"d":"114,380"},4]
[{"v":1384110,"d":"1,384,110"},53,{"v":108130,"d":"108,130"},4]
[{"v":1281980,"d":"1,281,980"},52,{"v":102130,"d":"102,130"},4]
[{"v":1185600,"d":"1,185,600"},51,{"v":96380,"d":"96,380"},4]
[{"v":1094720,"d":"1,094,720"},50,{"v":90880,"d":"90,880"},4]
[{"v":1009140,"d":"1,009,140"},49,{"v":85580,"d":"85,580"},4]
[{"v":928660,"d":"928,660"},48,{"v":80480,"d":"80,480"},4]
[{"v":853080,"d":"853,080"},47,{"v":75580,"d":"75,580"},4]
[{"v":782200,"d":"782,200"},46,{"v":70880,"d":"70,880"},4]
[{"v":715820,"d":"715,820"},45,{"v":66380,"d":"66,380"},4]
[{"v":653740,"d":"653,740"},44,{"v":62080,"d":"62,080"},4]
[{"v":595760,"d":"595,760"},43,{"v":57980,"d":"57,980"},4]
[{"v":541680,"d":"541,680"},42,{"v":54080,"d":"54,080"},4]
[{"v":491330,"d":"491,330"},41,{"v":50380,"d":"50,380"},4]
[{"v":444420,"d":"444,420"},40,{"v":46880,"d":"46,880"},4]
[{"v":400890,"d":"400,890"},39,{"v":43530,"d":"43,530"},4]
[{"v":360560,"d":"360,560"},38,{"v":40330,"d":"40,330"},4]
[{"v":323280,"d":"323,280"},37,{"v":37280,"d":"37,280"},4]
[{"v":288900,"d":"288,900"},36,{"v":34380,"d":"34,380"},4]
[{"v":257270,"d":"257,270"},35,{"v":31630,"d":"31,630"},4]
[{"v":228240,"d":"228,240"},34,{"v":29030,"d":"29,030"},4]
[{"v":201660,"d":"201,660"},33,{"v":26580,"d":"26,580"},4]
[{"v":177380,"d":"177,380"},32,{"v":24280,"d":"24,280"},4]
[{"v":155250,"d":"155,250"},31,{"v":22130,"d":"22,130"},4]
[{"v":135120,"d":"135,120"},30,{"v":20130,"d":"20,130"},4]
[{"v":116890,"d":"116,890"},29,{"v":18230,"d":"18,230"},4]
[{"v":100460,"d":"100,460"},28,{"v":16430,"d":"16,430"},4]
[{"v":85730,"d":"85,730"},27,{"v":14730,"d":"14,730"},4]
[{"v":72600,"d":"72,600"},26,{"v":13130,"d":"13,130"},4]
[{"v":60970,"d":"60,970"},25,{"v":11630,"d":"11,630"},4]
[{"v":50740,"d":"50,740"},24,{"v":10230,"d":"10,230"},4]
[{"v":41810,"d":"41,810"},23,{"v":8930,"d":"8,930"},4]
[{"v":34080,"d":"34,080"},22,{"v":7730,"d":"7,730"},4]
[{"v":27450,"d":"27,450"},21,{"v":6630,"d":"6,630"},4]
[{"v":21830,"d":"21,830"},20,{"v":5620,"d":"5,620"},4]
[{"v":17130,"d":"17,130"},19,{"v":4700,"d":"4,700"},4]
[{"v":13260,"d":"13,260"},18,{"v":3870,"d":"3,870"},4]
[{"v":10130,"d":"10,130"},17,{"v":3130,"d":"3,130"},4]
[{"v":7650,"d":"7,650"},16,{"v":2480,"d":"2,480"},4]
[{"v":5730,"d":"5,730"},15,{"v":1920,"d":"1,920"},4]
[{"v":4280,"d":"4,280"},14,{"v":1450,"d":"1,450"},4]
[{"v":3210,"d":"3,210"},13,{"v":1070,"d":"1,070"},4]
[{"v":2430,"d":"2,430"},12,780,4]
[{"v":1850,"d":"1,850"},11,580,4]
[{"v":1380,"d":"1,380"},10,470,4]
[{"v":1000,"d":"1,000"},9,380,4]
[700,8,300,4]
[470,7,230,4]
[300,6,170,4]
[180,5,120,4]
[100,4,80,4]
[50,3,50,4]
[20,2,30,4]
[0,1,20,0]

{"sheet":"다음레벨","index":6,"n_rows":251,"n_cols":4,"rows_kept":251,"hidden":true}
["레벨","누적 총 경험치","다음 렙업에 필요한 경험치","보너스스텟"]
[250,{"v":30000000000,"d":"30,000,000,000"},"-",20]
[249,{"v":28686973590,"d":"28,686,973,590"},{"v":1313026410,"d":"1,313,026,410"},20]
[248,{"v":27460317460,"d":"27,460,317,460"},{"v":1226656130,"d":"1,226,656,130"},20]
[247,{"v":26303661330,"d":"26,303,661,330"},{"v":1156656130,"d":"1,156,656,130"},20]
[246,{"v":25217005200,"d":"25,217,005,200"},{"v":1086656130,"d":"1,086,656,130"},20]
[245,{"v":24190349070,"d":"24,190,349,070"},{"v":1026656130,"d":"1,026,656,130"},20]
[244,{"v":23213692940,"d":"23,213,692,940"},{"v":976656130,"d":"976,656,130"},20]
[243,{"v":22277036810,"d":"22,277,036,810"},{"v":936656130,"d":"936,656,130"},20]
[242,{"v":21380380680,"d":"21,380,380,680"},{"v":896656130,"d":"896,656,130"},20]
[241,{"v":20523724550,"d":"20,523,724,550"},{"v":856656130,"d":"856,656,130"},20]
[240,{"v":19697068420,"d":"19,697,068,420"},{"v":826656130,"d":"826,656,130"},20]
[239,{"v":18900411290,"d":"18,900,411,290"},{"v":796656130,"d":"796,656,130"},20]
[238,{"v":18133756160,"d":"18,133,756,160"},{"v":766656130,"d":"766,656,130"},20]
[237,{"v":17397100030,"d":"17,397,100,030"},{"v":736656130,"d":"736,656,130"},20]
[236,{"v":16690443900,"d":"16,690,443,900"},{"v":706656130,"d":"706,656,130"},20]
[235,{"v":16006787770,"d":"16,006,787,770"},{"v":683656130,"d":"683,656,130"},20]
[234,{"v":15346131640,"d":"15,346,131,640"},{"v":660656130,"d":"660,656,130"},20]
[233,{"v":14708475510,"d":"14,708,475,510"},{"v":637656130,"d":"637,656,130"},20]
[232,{"v":14093819380,"d":"14,093,819,380"},{"v":614656130,"d":"614,656,130"},20]
[231,{"v":13502163250,"d":"13,502,163,250"},{"v":591656130,"d":"591,656,130"},20]
[230,{"v":12928507120,"d":"12,928,507,120"},{"v":573656130,"d":"573,656,130"},20]
[229,{"v":12372850990,"d":"12,372,850,990"},{"v":555656130,"d":"555,656,130"},20]
[228,{"v":11835194860,"d":"11,835,194,860"},{"v":537656130,"d":"537,656,130"},20]
[227,{"v":11315538730,"d":"11,315,538,730"},{"v":519656130,"d":"519,656,130"},20]
[226,{"v":10813882600,"d":"10,813,882,600"},{"v":501656130,"d":"501,656,130"},20]
[225,{"v":10327226470,"d":"10,327,226,470"},{"v":486656130,"d":"486,656,130"},20]
[224,{"v":9855570340,"d":"9,855,570,340"},{"v":471656130,"d":"471,656,130"},20]
[223,{"v":9398914210,"d":"9,398,914,210"},{"v":456656130,"d":"456,656,130"},20]
[222,{"v":8957258080,"d":"8,957,258,080"},{"v":441656130,"d":"441,656,130"},20]
[221,{"v":8530601950,"d":"8,530,601,950"},{"v":426656130,"d":"426,656,130"},20]
[220,{"v":8115945820,"d":"8,115,945,820"},{"v":414656130,"d":"414,656,130"},19]
[219,{"v":7713289690,"d":"7,713,289,690"},{"v":402656130,"d":"402,656,130"},19]
[218,{"v":7322633560,"d":"7,322,633,560"},{"v":390656130,"d":"390,656,130"},19]
[217,{"v":6943977430,"d":"6,943,977,430"},{"v":378656130,"d":"378,656,130"},19]
[216,{"v":6577321300,"d":"6,577,321,300"},{"v":366656130,"d":"366,656,130"},19]
[215,{"v":6220665170,"d":"6,220,665,170"},{"v":356656130,"d":"356,656,130"},18]
[214,{"v":5874009040,"d":"5,874,009,040"},{"v":346656130,"d":"346,656,130"},18]
[213,{"v":5537352910,"d":"5,537,352,910"},{"v":336656130,"d":"336,656,130"},18]
[212,{"v":5210696780,"d":"5,210,696,780"},{"v":326656130,"d":"326,656,130"},18]
[211,{"v":4894040650,"d":"4,894,040,650"},{"v":316656130,"d":"316,656,130"},18]
[210,{"v":4586384520,"d":"4,586,384,520"},{"v":307656130,"d":"307,656,130"},17]
[209,{"v":4287728390,"d":"4,287,728,390"},{"v":298656130,"d":"298,656,130"},17]
[208,{"v":3998072260,"d":"3,998,072,260"},{"v":289656130,"d":"289,656,130"},17]
[207,{"v":3717416130,"d":"3,717,416,130"},{"v":280656130,"d":"280,656,130"},17]
[206,{"v":3445760000,"d":"3,445,760,000"},{"v":271656130,"d":"271,656,130"},17]
[205,{"v":3183103870,"d":"3,183,103,870"},{"v":262656130,"d":"262,656,130"},16]
[204,{"v":2928447740,"d":"2,928,447,740"},{"v":254656130,"d":"254,656,130"},16]
[203,{"v":2681791610,"d":"2,681,791,610"},{"v":246656130,"d":"246,656,130"},16]
[202,{"v":2443135480,"d":"2,443,135,480"},{"v":238656130,"d":"238,656,130"},16]
[201,{"v":2212479350,"d":"2,212,479,350"},{"v":230656130,"d":"230,656,130"},16]
[200,{"v":1989823220,"d":"1,989,823,220"},{"v":222656130,"d":"222,656,130"},15]
[199,{"v":1775167090,"d":"1,775,167,090"},{"v":214656130,"d":"214,656,130"},15]
[198,{"v":1580510960,"d":"1,580,510,960"},{"v":194656130,"d":"194,656,130"},15]
[197,{"v":1405854830,"d":"1,405,854,830"},{"v":174656130,"d":"174,656,130"},15]
[196,{"v":1251198700,"d":"1,251,198,700"},{"v":154656130,"d":"154,656,130"},15]
[195,{"v":1116542570,"d":"1,116,542,570"},{"v":134656130,"d":"134,656,130"},14]
[194,{"v":1000886440,"d":"1,000,886,440"},{"v":115656130,"d":"115,656,130"},14]
[193,{"v":902230310,"d":"902,230,310"},{"v":98656130,"d":"98,656,130"},14]
[192,{"v":818574180,"d":"818,574,180"},{"v":83656130,"d":"83,656,130"},14]
[191,{"v":747918050,"d":"747,918,050"},{"v":70656130,"d":"70,656,130"},14]
[190,{"v":688261920,"d":"688,261,920"},{"v":59656130,"d":"59,656,130"},14]
[189,{"v":637605790,"d":"637,605,790"},{"v":50656130,"d":"50,656,130"},14]
[188,{"v":593949660,"d":"593,949,660"},{"v":43656130,"d":"43,656,130"},14]
[187,{"v":555693530,"d":"555,693,530"},{"v":38256130,"d":"38,256,130"},14]
[186,{"v":522237400,"d":"522,237,400"},{"v":33456130,"d":"33,456,130"},14]
[185,{"v":492981270,"d":"492,981,270"},{"v":29256130,"d":"29,256,130"},14]
[184,{"v":467325140,"d":"467,325,140"},{"v":25656130,"d":"25,656,130"},14]
[183,{"v":443359010,"d":"443,359,010"},{"v":23966130,"d":"23,966,130"},14]
[182,{"v":422552880,"d":"422,552,880"},{"v":20806130,"d":"20,806,130"},14]
[181,{"v":402856750,"d":"402,856,750"},{"v":19696130,"d":"19,696,130"},14]
[180,{"v":384200620,"d":"384,200,620"},{"v":18656130,"d":"18,656,130"},14]
[179,{"v":366534490,"d":"366,534,490"},{"v":17666130,"d":"17,666,130"},13]
[178,{"v":349818360,"d":"349,818,360"},{"v":16716130,"d":"16,716,130"},13]
[177,{"v":334012230,"d":"334,012,230"},{"v":15806130,"d":"15,806,130"},13]
[176,{"v":319076100,"d":"319,076,100"},{"v":14936130,"d":"14,936,130"},13]
[175,{"v":304969970,"d":"304,969,970"},{"v":14106130,"d":"14,106,130"},13]
[174,{"v":291653840,"d":"291,653,840"},{"v":13316130,"d":"13,316,130"},12]
[173,{"v":279087710,"d":"279,087,710"},{"v":12566130,"d":"12,566,130"},12]
[172,{"v":267231580,"d":"267,231,580"},{"v":11856130,"d":"11,856,130"},12]
[171,{"v":256045450,"d":"256,045,450"},{"v":11186130,"d":"11,186,130"},12]
[170,{"v":245489320,"d":"245,489,320"},{"v":10556130,"d":"10,556,130"},12]
[169,{"v":235523190,"d":"235,523,190"},{"v":9966130,"d":"9,966,130"},11]
[168,{"v":226117060,"d":"226,117,060"},{"v":9406130,"d":"9,406,130"},11]
[167,{"v":217240930,"d":"217,240,930"},{"v":8876130,"d":"8,876,130"},11]
[166,{"v":208864800,"d":"208,864,800"},{"v":8376130,"d":"8,376,130"},11]
[165,{"v":200958670,"d":"200,958,670"},{"v":7906130,"d":"7,906,130"},11]
[164,{"v":193492540,"d":"193,492,540"},{"v":7466130,"d":"7,466,130"},11]
[163,{"v":186436410,"d":"186,436,410"},{"v":7056130,"d":"7,056,130"},11]
[162,{"v":179640280,"d":"179,640,280"},{"v":6676130,"d":"6,676,130"},11]
[161,{"v":173434150,"d":"173,434,150"},{"v":6326130,"d":"6,326,130"},11]
[160,{"v":167428020,"d":"167,428,020"},{"v":6006130,"d":"6,006,130"},11]
[159,{"v":161711890,"d":"161,711,890"},{"v":5716130,"d":"5,716,130"},10]
[158,{"v":156265760,"d":"156,265,760"},{"v":5446190,"d":"5,446,190"},10]
[157,{"v":151069630,"d":"151,069,630"},{"v":5196130,"d":"5,196,130"},10]
[156,{"v":146103500,"d":"146,103,500"},{"v":4966130,"d":"4,966,130"},10]
[155,{"v":141347370,"d":"141,347,370"},{"v":4756130,"d":"4,756,130"},10]
[154,{"v":136781240,"d":"136,781,240"},{"v":4566130,"d":"4,566,130"},10]
[153,{"v":132385110,"d":"132,385,110"},{"v":4396130,"d":"4,396,130"},10]
[152,{"v":128138980,"d":"128,138,980"},{"v":4246130,"d":"4,246,130"},10]
[151,{"v":124022850,"d":"124,022,850"},{"v":4116130,"d":"4,116,130"},10]
[150,{"v":120016720,"d":"120,016,720"},{"v":4006130,"d":"4,006,130"},10]
[149,{"v":116118590,"d":"116,118,590"},{"v":3898130,"d":"3,898,130"},9]
[148,{"v":112326460,"d":"112,326,460"},{"v":3792130,"d":"3,792,130"},9]
[147,{"v":108638330,"d":"108,638,330"},{"v":3688130,"d":"3,688,130"},9]
[146,{"v":105052200,"d":"105,052,200"},{"v":3586130,"d":"3,586,130"},9]
[145,{"v":101566070,"d":"101,566,070"},{"v":3486130,"d":"3,486,130"},9]
[144,{"v":98117940,"d":"98,117,940"},{"v":3388130,"d":"3,388,130"},8]
[143,{"v":94885810,"d":"94,885,810"},{"v":3292130,"d":"3,292,130"},8]
[142,{"v":91687680,"d":"91,687,680"},{"v":3198130,"d":"3,198,130"},8]
[141,{"v":88581550,"d":"88,581,550"},{"v":3106130,"d":"3,106,130"},8]
[140,{"v":85565420,"d":"85,565,420"},{"v":3016130,"d":"3,016,130"},8]
[139,{"v":82637290,"d":"82,637,290"},{"v":2928130,"d":"2,928,130"},7]
[138,{"v":79795160,"d":"79,795,160"},{"v":2842130,"d":"2,842,130"},7]
[137,{"v":77037030,"d":"77,037,030"},{"v":2758130,"d":"2,758,130"},7]
[136,{"v":74360900,"d":"74,360,900"},{"v":2676130,"d":"2,676,130"},7]
[135,{"v":71764770,"d":"71,764,770"},{"v":2596130,"d":"2,596,130"},7]
[134,{"v":69246640,"d":"69,246,640"},{"v":2518130,"d":"2,518,130"},6]
[133,{"v":66804510,"d":"66,804,510"},{"v":2442130,"d":"2,442,130"},6]
[132,{"v":64436380,"d":"64,436,380"},{"v":2368130,"d":"2,368,130"},6]
[131,{"v":62140250,"d":"62,140,250"},{"v":2296130,"d":"2,296,130"},6]
[130,{"v":59914120,"d":"59,914,120"},{"v":2226130,"d":"2,226,130"},6]
[129,{"v":57756490,"d":"57,756,490"},{"v":2157630,"d":"2,157,630"},5]
[128,{"v":55665860,"d":"55,665,860"},{"v":2090630,"d":"2,090,630"},5]
[127,{"v":53640730,"d":"53,640,730"},{"v":2025130,"d":"2,025,130"},5]
[126,{"v":51679600,"d":"51,679,600"},{"v":1961130,"d":"1,961,130"},5]
[125,{"v":49780970,"d":"49,780,970"},{"v":1898630,"d":"1,898,630"},5]
[124,{"v":47943340,"d":"47,943,340"},{"v":1837630,"d":"1,837,630"},5]
[123,{"v":46165210,"d":"46,165,210"},{"v":1778130,"d":"1,778,130"},5]
[122,{"v":44445080,"d":"44,445,080"},{"v":1720130,"d":"1,720,130"},5]
[121,{"v":42781450,"d":"42,781,450"},{"v":1663630,"d":"1,663,630"},5]
[120,{"v":41172820,"d":"41,172,820"},{"v":1608630,"d":"1,608,630"},5]
[119,{"v":39617690,"d":"39,617,690"},{"v":1555130,"d":"1,555,130"},4]
[118,{"v":38114560,"d":"38,114,560"},{"v":1503130,"d":"1,503,130"},4]
[117,{"v":36661930,"d":"36,661,930"},{"v":1452630,"d":"1,452,630"},4]
[116,{"v":35258300,"d":"35,258,300"},{"v":1403630,"d":"1,403,630"},4]
[115,{"v":33902170,"d":"33,902,170"},{"v":1356130,"d":"1,356,130"},4]
[114,{"v":32592040,"d":"32,592,040"},{"v":1310130,"d":"1,310,130"},4]
[113,{"v":31326410,"d":"31,326,410"},{"v":1265630,"d":"1,265,630"},4]
[112,{"v":30103780,"d":"30,103,780"},{"v":1222630,"d":"1,222,630"},4]
[111,{"v":28922650,"d":"28,922,650"},{"v":1181130,"d":"1,181,130"},4]
[110,{"v":27781520,"d":"27,781,520"},{"v":1141130,"d":"1,141,130"},4]
[109,{"v":26679390,"d":"26,679,390"},{"v":1102130,"d":"1,102,130"},4]
[108,{"v":25615260,"d":"25,615,260"},{"v":1064130,"d":"1,064,130"},4]
[107,{"v":24588130,"d":"24,588,130"},{"v":1027130,"d":"1,027,130"},4]
[106,{"v":23597000,"d":"23,597,000"},{"v":991130,"d":"991,130"},4]
[105,{"v":22640870,"d":"22,640,870"},{"v":956130,"d":"956,130"},4]
[104,{"v":21718740,"d":"21,718,740"},{"v":922130,"d":"922,130"},4]
[103,{"v":20829610,"d":"20,829,610"},{"v":889130,"d":"889,130"},4]
[102,{"v":19972480,"d":"19,972,480"},{"v":857130,"d":"857,130"},4]
[101,{"v":19146350,"d":"19,146,350"},{"v":826130,"d":"826,130"},4]
[100,{"v":18350220,"d":"18,350,220"},{"v":796130,"d":"796,130"},4]
[99,{"v":17583090,"d":"17,583,090"},{"v":767130,"d":"767,130"},4]
[98,{"v":16843960,"d":"16,843,960"},{"v":739130,"d":"739,130"},4]
[97,{"v":16131830,"d":"16,131,830"},{"v":712130,"d":"712,130"},4]
[96,{"v":15445700,"d":"15,445,700"},{"v":686130,"d":"686,130"},4]
[95,{"v":14784570,"d":"14,784,570"},{"v":661130,"d":"661,130"},4]
[94,{"v":14147440,"d":"14,147,440"},{"v":637130,"d":"637,130"},4]
[93,{"v":13533310,"d":"13,533,310"},{"v":614130,"d":"614,130"},4]
[92,{"v":12941180,"d":"12,941,180"},{"v":592130,"d":"592,130"},4]
[91,{"v":12370050,"d":"12,370,050"},{"v":571130,"d":"571,130"},4]
[90,{"v":11818920,"d":"11,818,920"},{"v":551130,"d":"551,130"},4]
[89,{"v":11287290,"d":"11,287,290"},{"v":531630,"d":"531,630"},4]
[88,{"v":10774660,"d":"10,774,660"},{"v":512630,"d":"512,630"},4]
[87,{"v":10280530,"d":"10,280,530"},{"v":494130,"d":"494,130"},4]
[86,{"v":9804400,"d":"9,804,400"},{"v":476130,"d":"476,130"},4]
[85,{"v":9345770,"d":"9,345,770"},{"v":458630,"d":"458,630"},4]
[84,{"v":8904140,"d":"8,904,140"},{"v":441630,"d":"441,630"},4]
[83,{"v":8479010,"d":"8,479,010"},{"v":425130,"d":"425,130"},4]
[82,{"v":8069880,"d":"8,069,880"},{"v":409130,"d":"409,130"},4]
[81,{"v":7676250,"d":"7,676,250"},{"v":393630,"d":"393,630"},4]
[80,{"v":7297620,"d":"7,297,620"},{"v":378630,"d":"378,630"},4]
[79,{"v":6933590,"d":"6,933,590"},{"v":364030,"d":"364,030"},4]
[78,{"v":6583760,"d":"6,583,760"},{"v":349830,"d":"349,830"},4]
[77,{"v":6247730,"d":"6,247,730"},{"v":336030,"d":"336,030"},4]
[76,{"v":5925100,"d":"5,925,100"},{"v":322630,"d":"322,630"},4]
[75,{"v":5615470,"d":"5,615,470"},{"v":309630,"d":"309,630"},4]
[74,{"v":5318440,"d":"5,318,440"},{"v":297030,"d":"297,030"},4]
[73,{"v":5033610,"d":"5,033,610"},{"v":284830,"d":"284,830"},4]
[72,{"v":4760580,"d":"4,760,580"},{"v":273030,"d":"273,030"},4]
[71,{"v":4498950,"d":"4,498,950"},{"v":261630,"d":"261,630"},4]
[70,{"v":4248320,"d":"4,248,320"},{"v":250630,"d":"250,630"},4]
[69,{"v":4008390,"d":"4,008,390"},{"v":239930,"d":"239,930"},4]
[68,{"v":3778860,"d":"3,778,860"},{"v":229530,"d":"229,530"},4]
[67,{"v":3559430,"d":"3,559,430"},{"v":219430,"d":"219,430"},4]
[66,{"v":3349800,"d":"3,349,800"},{"v":209630,"d":"209,630"},4]
[65,{"v":3169670,"d":"3,169,670"},{"v":200130,"d":"200,130"},4]
[64,{"v":2958740,"d":"2,958,740"},{"v":190930,"d":"190,930"},4]
[63,{"v":2776710,"d":"2,776,710"},{"v":182030,"d":"182,030"},4]
[62,{"v":2603280,"d":"2,603,280"},{"v":173430,"d":"173,430"},4]
[61,{"v":2438150,"d":"2,438,150"},{"v":165130,"d":"165,130"},4]
[60,{"v":2281020,"d":"2,281,020"},{"v":157130,"d":"157,130"},4]
[59,{"v":2131640,"d":"2,131,640"},{"v":149380,"d":"149,380"},4]
[58,{"v":1989760,"d":"1,989,760"},{"v":141880,"d":"141,880"},4]
[57,{"v":1855130,"d":"1,855,130"},{"v":134630,"d":"134,630"},4]
[56,{"v":1727500,"d":"1,727,500"},{"v":127630,"d":"127,630"},4]
[55,{"v":1606620,"d":"1,606,620"},{"v":120880,"d":"120,880"},4]
[54,{"v":1492240,"d":"1,492,240"},{"v":114380,"d":"114,380"},4]
[53,{"v":1384110,"d":"1,384,110"},{"v":108130,"d":"108,130"},4]
[52,{"v":1281980,"d":"1,281,980"},{"v":102130,"d":"102,130"},4]
[51,{"v":1185600,"d":"1,185,600"},{"v":96380,"d":"96,380"},4]
[50,{"v":1094720,"d":"1,094,720"},{"v":90880,"d":"90,880"},4]
[49,{"v":1009140,"d":"1,009,140"},{"v":85580,"d":"85,580"},4]
[48,{"v":928660,"d":"928,660"},{"v":80480,"d":"80,480"},4]
[47,{"v":853080,"d":"853,080"},{"v":75580,"d":"75,580"},4]
[46,{"v":782200,"d":"782,200"},{"v":70880,"d":"70,880"},4]
[45,{"v":715820,"d":"715,820"},{"v":66380,"d":"66,380"},4]
[44,{"v":653740,"d":"653,740"},{"v":62080,"d":"62,080"},4]
[43,{"v":595760,"d":"595,760"},{"v":57980,"d":"57,980"},4]
[42,{"v":541680,"d":"541,680"},{"v":54080,"d":"54,080"},4]
[41,{"v":491330,"d":"491,330"},{"v":50380,"d":"50,380"},4]
[40,{"v":444420,"d":"444,420"},{"v":46880,"d":"46,880"},4]
[39,{"v":400890,"d":"400,890"},{"v":43530,"d":"43,530"},4]
[38,{"v":360560,"d":"360,560"},{"v":40330,"d":"40,330"},4]
[37,{"v":323280,"d":"323,280"},{"v":37280,"d":"37,280"},4]
[36,{"v":288900,"d":"288,900"},{"v":34380,"d":"34,380"},4]
[35,{"v":257270,"d":"257,270"},{"v":31630,"d":"31,630"},4]
[34,{"v":228240,"d":"228,240"},{"v":29030,"d":"29,030"},4]
[33,{"v":201660,"d":"201,660"},{"v":26580,"d":"26,580"},4]
[32,{"v":177380,"d":"177,380"},{"v":24280,"d":"24,280"},4]
[31,{"v":155250,"d":"155,250"},{"v":22130,"d":"22,130"},4]
[30,{"v":135120,"d":"135,120"},{"v":20130,"d":"20,130"},4]
[29,{"v":116890,"d":"116,890"},{"v":18230,"d":"18,230"},4]
[28,{"v":100460,"d":"100,460"},{"v":16430,"d":"16,430"},4]
[27,{"v":85730,"d":"85,730"},{"v":14730,"d":"14,730"},4]
[26,{"v":72600,"d":"72,600"},{"v":13130,"d":"13,130"},4]
[25,{"v":60970,"d":"60,970"},{"v":11630,"d":"11,630"},4]
[24,{"v":50740,"d":"50,740"},{"v":10230,"d":"10,230"},4]
[23,{"v":41810,"d":"41,810"},{"v":8930,"d":"8,930"},4]
[22,{"v":34080,"d":"34,080"},{"v":7730,"d":"7,730"},4]
[21,{"v":27450,"d":"27,450"},{"v":6630,"d":"6,630"},4]
[20,{"v":21830,"d":"21,830"},{"v":5620,"d":"5,620"},4]
[19,{"v":17130,"d":"17,130"},{"v":4700,"d":"4,700"},4]
[18,{"v":13260,"d":"13,260"},{"v":3870,"d":"3,870"},4]
[17,{"v":10130,"d":"10,130"},{"v":3130,"d":"3,130"},4]
[16,{"v":7650,"d":"7,650"},{"v":2480,"d":"2,480"},4]
[15,{"v":5730,"d":"5,730"},{"v":1920,"d":"1,920"},4]
[14,{"v":4280,"d":"4,280"},{"v":1450,"d":"1,450"},4]
[13,{"v":3210,"d":"3,210"},{"v":1070,"d":"1,070"},4]
[12,{"v":2430,"d":"2,430"},780,4]
[11,{"v":1850,"d":"1,850"},580,4]
[10,{"v":1380,"d":"1,380"},470,4]
[9,{"v":1000,"d":"1,000"},380,4]
[8,700,300,4]
[7,470,230,4]
[6,300,170,4]
[5,180,120,4]
[4,100,80,4]
[3,50,50,4]
[2,20,30,4]
[1,0,20,0]